{"text_format":"1","workbook":"xlsx","n_sheets":44,"sheets":["00 Alimenta","00 Aggregatore","00 CE","Tab 50-51","Dettaglio voce AA0280","Tab 52","Tab 52bis","Tab 53","Tab 54","Tab 55","Tab 56-57","AB01-02-03","Tab. 57bis","Tab 58","Tab 58 bis","Tab 59-60","Farmaceutica Convenzionata","AS01-AS02","Tab 60-bis","Tab 61","Tab 61bis","AS03","AS04","Tab 62","Tab 63","Tab 64-65","Tab 66-67-68-69","Personale in Comando","Personale Universitario","Altro Contratto","Personale - Conto annuale","Tabella 2 Consuntivo","Riconciliazione Tabella 2 vs CE","Fondi CCNL - Consistenza","Fondi CCNL - Serie Storica","Tab 71","Punto 23","Commento Accantonamenti","Punti 24-25","Punto 26","PS02-03-04-05","PS06","PS07","Foglio1"],"not_rendered":{"charts":0,"images":0,"macros":0,"external_links":1,"defined_names":22,"comments":0,"pivot_tables":0},"unopened":[],"bounds":{"document_bytes":16777216,"sheet_cells":100000,"rows_first":2000,"rows_last":500,"rows_between":2000,"halvings":0,"cell_chars":16384,"cell_head_chars":4096},"cells_cut":0,"cells_raw":0,"read":"whole","date_system":"1900"}

{"sheet":"00 Alimenta","index":0,"n_rows":576,"n_cols":5,"rows_kept":576,"cut":false,"hidden":true,"merged":[]}
[]
["PRG",4]
[]
["CE","Conto","Descrizione conto","Esercizio 2017","Esercizio 2018"]
["AA0030","0301010101","Contributi da Regione F.S. regionale indistinto per quota capitaria",535837429.24000001,544141166.15999997]
["AA0030","0301010102","Contributi da Regione F.S. regionale indistinto per funzioni",11928457.369999999,11338597.85]
["AA0040","0301010212","Quota per progetti di PSN L. 662/96",14815465.59,13751012.34]
["AA0040","0301010215","Quota per contributi da Regione per Emergenza Avicola L.205/2017 art.1 c.509",0,13789.5]
["AA0070","0301020101","Contributi da Regione (extra fondo) vincolati",123104.1,410404.72]
["AA0150","0301020306","Contributi da altri enti pubblici - vincolati",156684.25,168535.25]
["AA0250","0716010101","Rettifica contributi in c/esercizio per destinazione ad investimenti - da Regione per quota F.S. regionale",-6506318.8899999997,-4347846.8099999996]
["AA0280","0302010102","Utilizzo fondi per quote inutilizzate contributi di esercizi precedenti da Regione per quota emersione extracomunitari L. 102/09 art. 1 ter, comma 17 e D.Lgs. 109/2012 art. 5, comma 16",0,618167.12]
["AA0280","0302010103","Utilizzo fondi per quote inutilizzate contributi di esercizi precedenti da Regione per quota medicina Penitenziaria D.Lgs 230/99",94584,47292]
["AA0280","0302010104","Utilizzo fondi per quote inutilizzate contributi di esercizi precedenti per quota Medicina Penitenziaria art. 2 comma 283 L. 244/07",609546.18000000005,1278940.21]
["AA0280","0302010105","Utilizzo fondi per quote inutilizzate contributi di esercizi precedenti da Regione per quota hanseniani L. 31/86",0,0]
["AA0280","0302010107","Utilizzo fondi per quote inutilizzate contributi di esercizi precedenti da Regione per quota Extracomunitari irregolari L. 40/98",280768.86,0]
["AA0280","0302010108","Utilizzo fondi per quote inutilizzate contributi di esercizi precedenti da Regione per quota Fondo esclusività L 488/99",0,774519.17]
["AA0280","0302010111","Utilizzo fondi per quote inutilizzate contributi di esercizi precedenti da Regione per quota Aids L 135/90",0,291195.73]
["AA0280","0302010112","Utilizzo fondi per quote inutilizzate contributi di esercizi precedenti da Regione per quota Progetti di PSN L 662/96",4696121.0599999996,4839865.09]
["AA0280","0302010117","Utilizzo fondi per quote inutilizzate contributi di esercizio precedente da Regione per quota gioco d'azzardo Patologico (GAP) Legge 190/2014 e ss.mm.ii.",0,220805]
["AA0290","0302020101","Utilizzo fondi per quote inutilizzate contributi di esercizi precedenti da soggetti pubblici (extra fondo) vincolati",92452.46,0]
["AA0350","0303010101","Prestazioni di ricovero",30585746.350000001,31411147.640000001]
["AA0350","0303010102","Per assistenza ospedaliera (erogate da privato accreditato)",31524190.960000001,32521005.16]
["AA0360","0303010103","Prestazioni di specialistica ambulatoriale",5751324.0899999999,6072102.4699999997]
["AA0360","0303010105","Per altra assistenza specialistica ambulatoriale (erogate da privato accreditato)",2437190.17,2423368.2000000002]
["AA0370","0303010107","Prestazioni di psichiatria residenziale e semiresidenziale nelle Strutture Psicoriabilitative (erogate da privato accreditato)",4556497.3099999996,4667985.8600000003]
["AA0380","0303010108","Prestazioni di File F",13565690.02,13551276.25]
["AA0390","0303010109","Prestazioni servizi MMG, PLS, Continuità assistenziale",57455.65,76930.02]
["AA0400","0303010110","Prestazioni servizi farmaceutica convenzionata",1531007.26,1554303.34]
["AA0410","0303010112","per assistenza termale (erogate da privato accreditato)",1104099.8899999999,1071238.47]
["AA0420","0303010113","Prestazioni trasporto ambulanze ed elisoccorso",175653.51,176712.63]
["AA0430","0303010118","Per assistenza riabilitativa schema tipo previsto ex art. 26  L. 833/78 ",3470706.26,3898231.58]
["AA0430","0303010119","Per prestazioni ad anziani non autosufficienti nei Centri Residenziali",151334.26999999999,154181.96]
["AA0430","0303010120","Per prestazioni ad anziani non autosufficienti nelle Residenze Sanitarie Assistite",1770163.85,1931897.43]
["AA0440","0303010203","Altre prestazioni sanitarie e sociosanitarie a rilevanza sanitaria erogate ad altri soggetti pubblici",45364.98,90381.5]
["AA0460","0303010301","Prestazioni di ricovero",1554681.22,7320391.0700000003]
["AA0470","0303010302","Prestazioni ambulatoriali",851774.85,1477229.91]
["AA0490","0303010304","Prestazioni di File F",1604980.14,2471453.08]
["AA0500","0303010305","Prestazioni servizi MMG, PLS, Continuità assistenziale Extraregione",119388.84,56122.64]
["AA0510","0303010306","Prestazioni servizi farmaceutica convenzionata Extraregione",502038.11,506661.23]
["AA0520","0303010307","Prestazioni termali Extraregione",172275.4,180073.68]
["AA0530","0303010308","Prestazioni trasporto ambulanze ed elisoccorso Extraregione",512404.02,469730.81]
["AA0550","0303010311","Ricavi per cessione di emocomponenti e cellule staminali Extraregione",174766.05,0]
["AA0590","0303010314","Altre prestazioni sanitarie e socio-sanitarie a rilevanza sanitaria non soggette a compensazione Extraregione",1696.8,2626.39]
["AA0600","0303010315","Altre prestazioni sanitarie a rilevanza sanitaria - Mobilità attiva Internazionale",0,318967.76]
["AA0620","0303020101","Prestazioni di ricovero da privati Extraregione in compensazione (mobilità attiva)",11917704.07,10285883.1]
["AA0630","0303020201","Prestazioni ambulatoriali da privati Extraregione in compensazione (mobilità attiva)",218419.7,201606.44]
["AA0660","0303030101","Proventi per rilascio cartelle cliniche, radiografie e certificati",115699.42,146436.07999999999]
["AA0660","0303030102","Proventi per multe, ammende e contravvenzioni di vigili sanitari",44855.15,2500]
["AA0660","0303030103","Proventi per sanzioni in materia di lavoro",0,27593.38]
["AA0660","0303030104","Proventi per prestazioni di medicina del lavoro",1020.47,540.64]
["AA0660","0303030105","Proventi per sanzioni sanità pubblica veterinaria",10077.74,9396.75]
["AA0660","0303030106","Proventi per diritti veterinari ex art.3 D.lgs. 51/92",312591.95,327976.69]
["AA0660","0303030107","Proventi per sanzioni amministrative",88655.9,140693.07]
["AA0660","0303030108","Proventi sperimentazioni farmaci e cliniche",80519.63,143256.79999999999]
["AA0660","0303030109","Proventi per servizi di medicina legale",577975.03,551600.1]
["AA0660","0303030110","Ricavi per somministrazione di vaccini",262.60000000000002,118766.74]
["AA0660","0303030111","Proventi per prestazioni di medicina sportiva",34421.300000000003,32128.55]
["AA0660","0303030114","Altri ricavi per prestazioni sanitarie erogate a soggetti privati",320299.61,312040.17]
["AA0660","0303030115","Ricavi per prestazioni specialistiche ambulatoriali  (a privati paganti)",1158003.1399999999,786234.17]
["AA0660","0303030116","Ricavi per ricovero ospedaliero ",40542.93,270609.03999999998]
["AA0660","0303030117","Ricavi per prestazioni del dipartimento di prevenzione",766497.59,401104.96]
["AA0660","0303030118","Ricavi per consulenze sanitarie mediche e veterinarie",14715.73,11274.96]
["AA0660","0303030122","Ricavi cessione sangue ed emoderivati vs privati",3268.12,338352.21]
["AA0680","0303040101","Ricavi per prestazioni sanitarie intramoenia - Area ospedaliera",50045.82,80436.56]
["AA0690","0303040201","Ricavi per prestazioni sanitarie intramoenia - Area specialistica",3252006,3326104]
["AA0700","0303040301","Ricavi per prestazioni sanitarie intramoenia - Area sanità pubblica",22414.54,17534.57]
["AA0710","0303040401","Ricavi per prestazioni sanitarie intramoenia - Consulenze (ex art. 55 c. 1 lett. c), d) ed ex art. 57-58)",478823.7,677848.85]
["AA0730","0303040601","Ricavi per prestazioni sanitarie intramoenia - Altro",97870.17,130775.39]
["AA0740","0303040701","Ricavi per prestazioni sanitarie intramoenia - Altro (Aziende sanitarie pubbliche della Regione)",18272.099999999999,5779.7]
["AA0760","0304010101","Rimborsi assicurativi",166973.67000000001,151672.57999999999]
["AA0810","0304030101","Rimborso degli oneri stipendiali del personale dipendente dell'azienda in posizione di comando presso Aziende sanitarie pubbliche della Regione",14346.46,23253.72]
["AA0830","0304030301","Altri concorsi, recuperi e rimborsi da parte di Aziende sanitarie pubbliche della Regione",135883.64000000001,180596.98]
["AA0850","0304040101","Rimborso degli oneri stipendiali del personale dipendente dell'azienda in posizione di comando presso altri soggetti pubblici",114750.81,150326.43]
["AA0860","0304040201","Rimborsi per acquisto beni sanitari v/altri Enti Pubblici",14709.64,8374.7800000000007]
["AA0870","0304040303","Concorso da comuni per integr.rette RSA",87662,81077.240000000005]
["AA0870","0304040304","Altri concorsi, recuperi e rimborsi da parte di altri soggetti pubblici",70008.22,13333.41]
["AA0900","0304050101","Pay-back per il superamento del tetto della spesa farmaceutica territoriale",0,0]
["AA0910","0304050102","Pay-back per il superamento del tetto della spesa farmaceutica ospedaliera",20,0]
["AA0920","0304050103","Ulteriore Pay-back",3426932.4,2615698.91]
["AA0930","0304050201","Altri concorsi, recuperi e rimborsi da privati",866980.31,634408.52]
["AA0950","0305010101","Compartecipazione alla spesa per prestazioni sanitarie - Ticket sulle prestazioni per visite specialistiche",3378962.08,3159047.66]
["AA0950","0305010102","Compartecipazione alla spesa per prestazioni sanitarie - Ticket sulle prestazioni per diagnostica strumentale",1382098.47,1443223.8]
["AA0950","0305010103","Compartecipazione alla spesa per prestazioni sanitarie - Ticket sulle prestazioni per analisi di laboratorio",1653708.77,1940873.85]
["AA0960","0305020101","Compartecipazione alla spesa per prestazioni sanitarie - Ticket sul pronto soccorso",330322.76,386661.64]
["AA0990","0306010101","Quota imputata all'esercizio dei finanziamenti per investimenti dallo Stato",48286.07,54754.03]
["AA1000","0306020101","Quota imputata all'esercizio dei finanziamenti per investimenti da Regione",1468544.84,1674245.68]
["AA1010","0306030101","Quota imputata all'esercizio dei finanziamenti per beni di prima dotazione",3577467.93,3577467.93]
["AA1020","0306040101","Quota imputata all'esercizio dei contributi in c/esercizio FSR destinati ad investimenti",4730694.3099999996,5185207.28]
["AA1070","0308010102","Ricavi per consulenze, certificazioni e attestazioni non sanitarie",1820.06,0]
["AA1070","0308010103","Ricavi per maggior comfort alberghiero",1203.5999999999999,1738.6]
["AA1080","0308020101","Affitti attivi ",221560.64,186882.15]
["AA1090","0308030102","Proventi per multe, ammende e contravvenzioni (non sanitarie)",39513.47,34071.35]
["AA1090","0308030104","Proventi per gestione distributori automatici di bibite",13350.83,3934.44]
["AA1090","0308030105","Proventi per corsi di formazione",50820,57821.38]
["AA1090","0308030109","Altri proventi non sanitari",294032.8,266999.03999999998]
["BA0040","0701010101","Medicinali con AIC",-58058876.310000002,-70487643.319999993]
["BA0040","0701010102","Soluzioni infusionali con AIC",-36070.949999999997,-17397.05]
["BA0040","0701010103","Ossigeno con AIC",-1784465.77,-1358852.21]
["BA0040","0701010104","Altri gas medicali con AIC",-169365.48,-174947.81]
["BA0040","0701010105","Emoderivati con AIC",-3209150.92,-2011801.43]
["BA0040","0701010108","Farmaci innovativi",-5977880.04,-8485995.2699999996]
["BA0050","0701010106","Medicinali senza AIC",-722585.84,-752264.34]
["BA0090","0701010202","Sangue ed emocomponenti da pubblico (Aziende sanitarie pubbliche extra Regione) - Mobilità extraregionale",-187348.99,-23080.75]
["BA0220","0701010301","Strumentazione per bioimmagini e radioterapia",-177143.11,-81557.27]
["BA0220","0701010302","Materiale per sterilizzazione",-129624.42,-46837.63]
["BA0220","0701010303","Dispositivi per chirurgia mini-invasiva ed elettrochirurgia",-1449807.99,-1483448.22]
["BA0220","0701010304","Protesi ortopediche e mezzi per osteosintesi e sintesi tendineo-legamentosa",-2805651.43,-3078145.23]
["BA0220","0701010305","Protesi oculistiche",-204139.51999999999,-232024.76]
["BA0220","0701010306","Protesi vascolari e cardiache",-1648630.99,-1843129.03]
["BA0220","0701010307","Altri dispositivi protesici impiantabili e prodotti per osteosintesi",-64076.91,-53882.09]
["BA0220","0701010308","Supporti e ausili tecnici per persone disabili",-88676.58,-126750.9]
["BA0220","0701010309","Dispositivi per emotrasfusione ed ematologia",-639214.71,-429955.11]
["BA0220","0701010310","Dispositivi per dialisi",-1517787.64,-1649439.47]
["BA0220","0701010312","Dispositivi da somministrazione, prelievo e raccolta ",-3502487.78,-3688519.83]
["BA0220","0701010314","Strumentazione per esplorazioni funzionali ed interventi terapeutici",-955175.28,-988781.88]
["BA0220","0701010315","Strumentazione per radiologia diagnostica ed interventistica",-1054.08,-1609.85]
["BA0220","0701010316","Strumentario chirurgico pluriuso o riusabile",-736677.23,-631469.93000000005]
["BA0220","0701010317","Dispositivi protesici impiantabili - vari",-201076.3,-196988.74]
["BA0220","0701010318","Dispositivi per sistema artero-venoso",-1942531.26,-2170842.0099999998]
["BA0220","0701010319","Guide per apparato cardiocircolatorio",-436779.31,-374481.76]
["BA0220","0701010320","Altri dispositivi per apparato cardiocircolatorio",-934868.19,-1021118.45]
["BA0220","0701010321","Disinfettanti, antisettici e proteolitici (D.Lgs. 46/97)",-95830.94,-117827.27]
["BA0220","0701010322","Dispositivi per apparato gastrointestinale",-345091.34,-362947.48]
["BA0220","0701010323","Dispositivi da sutura",-1485021.04,-1286174]
["BA0220","0701010324","Dispositivi per sistema nervoso e midollare",-79263.37,-120204.52]
["BA0220","0701010325","Dispositivi per odontoiatria, oftalmologoa e otorinolaringoiatria",-364072.05,-544399.05000000005]
["BA0220","0701010326","Dispositivi per apparato respiratorio e anestesia",-505376.99,-602906.88]
["BA0220","0701010327","Dispositivi di protezione e ausili per incontinenza (D.Lgs. 46/97)",-1642742.81,-2080336.8]
["BA0220","0701010328","Dispositivi per apparato urogenitale",-204049.87,-177026.73]
["BA0220","0701010329","Dispositivi vari",-1684981.19,-1728420.73]
["BA0220","0701010330","Dispositivi per medicazioni generali e specialistiche",-1922863.46,-1894088.33]
["BA0230","0701010313","Dispositivi impiantabili attivi",-3456008.28,-3071999.01]
["BA0240","0701010311","Dispositivi medico-diagnostici in vitro (D.Lgs. 332/2000)",-11969007.5,-12786548.720000001]
["BA0250","0701010401","Prodotti dietetici",-29236.46,-37219.06]
["BA0250","0701010402","Alimenti per nutrizione artificiale senza AIC",-440409.28,-431741.6]
["BA0260","0701010502","Vaccini obbligatori",-602023.59,-575429.16]
["BA0260","0701010503","Altri vaccini",-1778838.97,-1647355.95]
["BA0280","0701010701","Medicinali ad uso veterinario",-7133.98,-11791.41]
["BA0280","0701010702","Materiali chirurgici, sanitari e diagnostici per uso veterinario",-718.82,-8845]
["BA0290","0701010801","Vetrerie e materiale plastico per laboratorio (senza CND)",-49771.13,-54713.99]
["BA0290","0701010802","Altri materiali di consumo non specifici per strumentazione diagnostica (senza CND)",-532760.96,-805000.83]
["BA0290","0701010803","Altri beni e prodotti sanitari (senza CND)",-1352042.51,-1333791.77]
["BA0320","0701020101","Prodotti alimentari",-250.58,-83.52]
["BA0330","0701020102","Materiali di guardaroba, di pulizia e di convivenza in genere",-41796.379999999997,-64306.42]
["BA0340","0701020103","Combustibili, carburanti e lubrificanti",-135937.70000000001,-172419.52]
["BA0350","0701020104","Supporti informatici",-186697.36,-127864.8]
["BA0350","0701020105","Cancelleria e stampati",-327030.51,-350110.1]
["BA0360","0701020106","Materiale per la manutenzione di immobili e loro pertinenze",-181769.46,-188488.95999999999]
["BA0360","0701020108","Materiale per la manutenzione di attrezzature tecnico scientifiche sanitarie",-16225.33,-44936.27]
["BA0360","0701020110","Materiale per la manutenzione di altro",-9788.74,-6459.14]
["BA0370","0701020111","Altri beni e prodotti non sanitari",-48626.559999999998,-45073.96]
["BA0430","0702010101","Costi per assistenza MMG",-24328709.329999998,-24517314.75]
["BA0440","0702010102","Costi per assistenza PLS",-6208374.4000000004,-6415070.5300000003]
["BA0450","0702010103","Costi per assistenza Continuità assistenziale",-4008916.53,-3931463.93]
["BA0460","0702010104","Costi per assistenza Medici 118",-718220.61,-653212.61]
["BA0460","0702010105","Altro (medicina dei servizi, psicologi, etc¿) (esclusa IRAP)",-171628.48,-136443.5]
["BA0470","0702010106","Costi per medicina di base da pubblico (Aziende sanitarie pubbliche della Regione) - Mobilità intraregionale",-35057.19,-38671]
["BA0480","0702010107","Costi per medicina di base da pubblico (Aziende sanitarie pubbliche Extraregione) - Mobilità extraregionale",-184748.58,-217107.5]
["BA0500","0702010201","Acquisti servizi sanitari per farmaceutica da convenzione",-52796218.850000001,-50005470.409999996]
["BA0500","0702010202","Acquisti servizi sanitari sussidi  Indennità per farmacie rurali ed altro",-127926.67,-124207.82]
["BA0510","0702010203","Costi per farmaceutica da pubblico (Aziende sanitarie pubbliche della Regione)- Mobilità intraregionale",-1251970.51,-1277628.07]
["BA0520","0702010204","Costi per farmaceutica da pubblico (Extraregione)",-387832.02,-457054.73]
["BA0540","0702010301","Costi per assistenza specialistica ambulatoriale da pubblico (Aziende sanitarie pubbliche della Regione)",-7681961.0099999998,-7623510.4000000004]
["BA0540","0702010302","Servizi sanitari da privato accreditato insito in Regione territorio extra ASL v/ cittadini residenti in territorio ASL  - rientranti nei contratti negoziali (branche a visita)",-82.34,-81.98]
["BA0540","0702010303","Servizi sanitari da case di cura private insite in Regione territorio extra ASL v/ cittadini residenti in territorio ASL - rientranti nei contratti negoziali (assistenza specialistica ambulatoriale)",-1255932.25,-1200763.1000000001]
["BA0540","0702010304","Servizi sanitari da altri soggetti privati insiti in Regione territorio extra ASL v/cittadini residenti nel territorio ASL rientranti nei contratti negoziali (assistenza specialistica ambulatoriale)",-60146.51,-55004.09]
["BA0550","0702010305","Costi per assistenza specialistica ambulatoriale da pubblico (altri soggetti pubblici della Regione)",-189344.67,-360209.89]
["BA0560","0702010306","Costi per assistenza specialistica ambulatoriale  da pubblico (Extraregione)",-4257839.75,-4000753.58]
["BA0560","0702010325","Costi per cessioni di emocomponenti e cellule staminali extraregione",-202185.19,0]
["BA0570","0702010307","Costi per assistenza specialistica ambulatoriale  da privato - Medici SUMAI",-4899151.05,-4486744.21]
["BA0590","0702010308","Servizi sanitari per assistenza specialistica da IRCCS privati e Policlinici privati",-60978.73,-83336.34]
["BA0610","0309010805","Compartecipazione alla spesa per prestazioni sanitarie - Ticket sulle prestazioni assistenza specialistica ambulatoriale da Case di Cura private",1025595.31,976058.35]
["BA0610","0309010806","Quota fissa di cui all¿art. 17, comma 6, del D.L. 98/2011 per assistenza specialistica ambulatoriale da Case di Cura private ",352280,337730]
["BA0610","0702010310","Servizi sanitari da case di cura private insite nel territorio ASL v/ cittadini residenti  nel territorio ASL - rientranti nei contratti negoziali (assistenza specialistica ambulatoriale)",-4475774.26,-4514981.5]
["BA0610","0702010311","Servizi sanitari da case di cura private insite nel territorio ASL v/cittadini residenti nella Regione in territorio extra ASL rientranti nei contratti negoziali (assist. specialistica ambulatoriale)",-2312295.34,-2248145.5099999998]
["BA0610","0702010313","Servizi sanitari da case di cura private - per cittadini residenti acquistate fuori contratti negoziali in strutture entro Regione (assistenza specialistica ambulatoriale)",-2664.58,-14348.16]
["BA0620","0309010807","Compartecipazione alla spesa per prestazioni sanitarie - Ticket sulle prestazioni assistenza specialistica ambulatoriale da altri privati",216258.62,188629.47]
["BA0620","0309010808","Quota fissa di cui all¿art. 17, comma 6, del D.L. 98/2011 per assistenza specialistica ambulatoriale da altri privati ",18668,58256.15]
["BA0620","0702010314","Servizi sanitari da privato accreditato insito nel territorio ASL v/ cittadini residenti in territorio ASL - rientranti nei contratti negoziali (branche a visita)",-28717.88,-32601.73]
["BA0620","0702010315","Servizi sanitari da privato accreditato insito nel territorio ASL v/ cittadini residenti nella Regione in territorio extra ASL - rientranti nei contratti negoziali (branche a visita)",-3499.07,-6587.94]
["BA0620","0702010316","Servizi sanitari da privato accreditato per cittadini residenti acquistate in strutture fuori Regione (branche a visita)",0,-3.2]
["BA0620","0702010318","Servizi sanitari da altri soggetti privati insiti nel Territorio ASL v/ cittadini residenti nel territorio ASL - rientranti nei contratti negoziali (assistenza specialistica ambulatoriale)",-2993859.48,-3035421.56]
["BA0620","0702010319","Servizi sanitari da altri soggetti privati insiti nel territorio ASL v/cittadini residenti nella Regione in territorio extra ASL rientranti nei contratti negoziali (ass. specialistica ambulatoriale)",-490557.54,-506050.07]
["BA0620","0702010321","Servizi sanitari da altri soggetti privati - per cittadini residenti acquistate fuori contratti negoziali in strutture entro Regione (assistenza specialistica ambulatoriale)",-2298.15,-5003.97]
["BA0630","0309010809","Compartecipazione alla spesa per prestazioni sanitarie - Ticket sulle prestazioni assistenza specialistica ambulatoriale da privato per cittadini non residenti - Extraregione",3321.5,3738.21]
["BA0630","0309010810","Quota fissa di cui all¿art. 17, comma 6, del D.L. 98/2011 per assistenza specialistica ambulatoriale da privato per cittadini non residenti - Extraregione",400,1170]
["BA0630","0702010322","Servizi sanitari da privato accreditato v/ cittadini non residenti - extraregione (mobilità attiva in compensazione) (branche a visita)",0,-108.07]
["BA0630","0702010323","Servizi sanitari da case di cura private v/ cittadini non residenti - extraregione (mobilità attiva in compensazione)  (assistenza specialistica ambulatoriale)",-181939.89,-155652.49]
["BA0630","0702010324","Servizi sanitari da altri soggetti privati v/ cittadini non residenti - extraregione (mobilità attiva in compensazione) (assistenza specialistica ambulatoriale)",-36479.81,-45845.88]
["BA0650","0702010402","Da privato accreditato insito in Regione territorio extra ASL v/ cittadini residenti in territorio ASL  - rientranti nei contratti negoziali (riabilitazione ex art. 26)",-4855060.17,-4832965.95]
["BA0680","0702010405","Da privato accreditato insito nel territorio ASL v/ cittadini residenti in territorio ASL - rientranti nei contratti negoziali (riabilitazione ex art. 26)",-10990063.199999999,-10714220.15]
["BA0680","0702010406","Da privato accreditato insito nel territorio ASL v/ cittadini residenti nella Regione in territorio extra ASL - rientranti nei contratti negoziali (riabilitazione ex art. 26)",-3470706.26,-3898231.58]
["BA0690","0702010408","Da privato accreditato per cittadini residenti acquistate in strutture fuori Regione (riabilitazione ex art. 26)",-591378.35,-545484.88]
["BA0740","0702010504","Da privato per assistenza integrativa",-1813040.82,-1802068.84]
["BA0790","0702010604","Da privato per assistenza protesica",-4792096.16,-4852166.28]
["BA0790","0702010605","Da privato per materiale per incontinenza",-1592199.38,-1451062.73]
["BA0810","0702010701","Da pubblico per assistenza ospedaliera (Aziende sanitarie pubbliche della Regione)",-25677170,-23797587]
["BA0810","0702010702","Da privato accreditato per assistenza ospedaliera insito in Regione territorio extra ASL v/cittadini residenti in territorio ASL - rientranti nei contratti negoziali ",-2552921.6800000002,-2683945.39]
["BA0830","0702010704","Da pubblico per assistenza ospedaliera (Extraregione)",-23048879.050000001,-24057993.460000001]
["BA0870","0309010905","Compartecipazione alla spesa per prestazioni sanitarie - Ticket sulle sulle prestaz. trasferite dal regime di ricovero ordinario in regime ambulatoriale (DCA 50/2011) da Case di Cura private",70673.25,75661.95]
["BA0870","0309010906","Quota fissa di cui all¿art. 17, comma 6, del D.L. 98/2011 per prestaz. trasferite dal regime di ricovero ordinario in regime ambulatoriale (DCA 50/2011) da Case di Cura private ",19550,20930]
["BA0870","0702010708","Da privato accreditato per assistenza ospedaliera insito nel territorio ASL v/ cittadini residenti in territorio ASL - rientranti nei contratti negoziali ",-30343478.91,-30203429.02]
["BA0870","0702010709","Da privato accreditato per assistenza ospedaliera insito nel territorio ASL v/ cittadini residenti nella Regione in territorio extra ASL - rientranti nei contratti negoziali ",-31556509.059999999,-32557191.309999999]
["BA0890","0702010705","Da privato accreditato per assistenza ospedaliera per cittadini non residenti - extraregione (mobilità attiva in compensazione) ",-11917704.07,-10285883.140000001]
["BA0910","0702010802","Da privato accreditato insito in Regione territorio extra ASL v/ cittadini residenti in territorio ASL  - rientranti nei contratti negoziali  (Strutture Psicoriabilitative)",-1648164.66,-1551575.5]
["BA0930","0702010804","Da pubblico per psichiatria residenziale e semiresidenziale (Extraregione) - non soggette a compensazione",-6667,-81781.600000000006]
["BA0940","0702010805","Da privato accreditato insito nel territorio ASL v/cittadini residenti in territorio ASL - rientranti nei contratti negoziali (Strutture Psicoriabilitative) (intraregionale)",-4344965.76,-4308037.8499999996]
["BA0940","0702010806","Da privato accreditato insito nel territorio ASL v/cittadini residenti nella Regione in territorio extra ASL - rientranti nei contratti negoziali (Strutture psicoriabilitative) (intraregionale)",-4556497.3099999996,-4667985.8600000003]
["BA0940","0702010807","Da privato accreditato per cittadini residenti acquistate fuori contratti negoziali in strutture entro Regione (Strutture Psicoriabilitative) (intraregionale)",-770417.52,-822496.13]
["BA0950","0702010809","Da privato accreditato per cittadini residenti acquistate in strutture fuori Regione (Strutture Psicoriabilitative) (extraregionale)",-1872398.81,-1589885.46]
["BA0970","0702010901","Da pubblico per prestazioni di distribuzione farmaci File F (Aziende sanitarie pubbliche della Regione) - Mobilità intraregionale",-4391409.7,-4464112.37]
["BA0990","0702010903","Da pubblico per prestazioni di distribuzione farmaci File F (Extraregione)",-1585422.33,-2195879.04]
["BA1000","0702010905","Da privato (intraregionale) - Servizio di distribuzione farmaci PHT (DPC)",0,-432985.28]
["BA1060","0702011004","Da pubblico per prestazioni termali in convenzione (Extraregione)",-159884.29,-95302.31]
["BA1070","0309011001","Compartecipazione alla spesa per prestazioni sanitarie - Ticket sulle prestazioni termali in convenzione - da privato",448685.4,436740.1]
["BA1070","0702011005","Da privato accreditato per prestazioni termali in convenzione insito nel territorio ASL v/ cittadini residenti in territorio ASL - rientranti nei contratti negoziali ",-985595.98,-943261.34]
["BA1070","0702011006","Da privato accreditato per prestazioni termali in convenzione insito nel territorio ASL v/ cittadini residenti nella Regione in territorio extra ASL - rientranti nei contratti negoziali",-1351679.39,-1315059.27]
["BA1080","0309011003","Compartecipazione alla spesa per prestazioni sanitarie - Ticket sulle prestazioni termali in convenzione - da privato per cittadini non residenti - Extraregione",61178.8,55622.1]
["BA1080","0702011009","Da privato per prestazioni termali in convenzione per cittadini non residenti - Extraregione (mobilità attiva in compensazione)",-301368.37,-288244.99]
["BA1100","0702011101","Da pubblico (Aziende sanitarie pubbliche della Regione) per trasporti sanitari per l'emergenza (Mobilità intraregionale)",-124342.79,-103216]
["BA1120","0702011105","Da pubblico per trasporti sanitari per l'emergenza (Extraregione)",-228483.68,-344124.9]
["BA1130","0702011107","Da privato per trasporti sanitari per l'emergenza",-6679147.3799999999,-6876548.2699999996]
["BA1130","0702011108","Da privato per altri tipi di trasporto sanitario ",-1480764,-1459453.29]
["BA1150","0702011205","Da privato accreditato insito in Regione territorio extra ASL v/ cittadini residenti in territorio ASL  - rientranti nei contratti negoziali  (Centri Residenziali)",-1337419.83,-1445082.32]
["BA1150","0702011206","Da privato accreditato insito in Regione territorio extra ASL v/ cittadini residenti in territorio ASL  - rientranti nei contratti negoziali  (Residenze Sanitarie Assistite)",-400041.29,-313438.06]
["BA1170","0702011211","Da pubblico per assistenza geriatrica (extraregione) non soggetto a compensazione",-168459.48,-160969.38]
["BA1180","0702011215","Da privato accreditato insito nel territorio ASL v/ cittadini residenti in territorio ASL - rientranti nei contratti negoziali (Centri Residenziali)",-621441.44999999995,-618593.76]
["BA1180","0702011216","Da privato accreditato insito nel territorio ASL v/ cittadini residenti nella Regione in territorio extra ASL - rientranti nei contratti negoziali (Centri Residenziali)",-151334.26999999999,-154181.96]
["BA1180","0702011218","Da privato accreditato insito nel territorio ASL v/ cittadini residenti in territorio ASL - rientranti nei contratti negoziali (Residenze Sanitarie Assistite)",-2850165.21,-2817942.98]
["BA1180","0702011219","Da privato accreditato insito nel territorio ASL v/ cittadini residenti nella Regione in territorio extra ASL - rientranti nei contratti negoziali (Residenze Sanitarie Assistite)",-1770163.85,-1931897.43]
["BA1180","0702011221","Da privato per assistenza ai tossicodipendenti e alcolisti  (intraregionale)",-1018117.84,-1120984.6000000001]
["BA1180","0702011224","Assistenza Domiciliare Integrata da privato (intraregionale)",-5249388.05,-5163857.88]
["BA1180","0702011225","Altre prestazioni socio sanitarie a rilevanza sanitaria da privato (intraregionale e extraregionale)",-891013.35,-693177.29]
["BA1190","0702011226","Da privato accreditato per assistenza geriatrica per cittadini residenti acquistate in strutture fuori Regione (Centri Residenziali)",-75595.22,-57522.69]
["BA1190","0702011227","Da privato accreditato per assistenza geriatrica per cittadini residenti acquistate in strutture fuori Regione (Residenze Sanitarie Assistite)",-35386.75,-56827.64]
["BA1190","0702011228","Da privato per assistenza ai tossicodipendenti e alcolisti  (extraregionale)",-1639945.78,-1753167.57]
["BA1190","0702011229","Assistenza in Hospice da privato (extraregionale)",-840,-19125.009999999998]
["BA1190","0702011230","Assistenza Domiciliare Integrata a privato (extraregionale)",0,-770]
["BA1210","0702011301","Compartecipazione al personale per attività libero professionale intramoenia - Area ospedaliera",-34683.29,-50718.76]
["BA1210","0702011302","Fondo perequativo per attività libero professionale intramoenia - Area ospedaliera",-2118.0500000000002,-3499.34]
["BA1220","0702011304","Compartecipazione al personale per attività libero professionale intramoenia - Area specialistica",-2628075.62,-2386145.4900000002]
["BA1220","0702011305","Fondo perequativo per attività libero professionale intramoenia - Area specialistica",-162576.15,-177601.98]
["BA1220","0702011306","Convenzioni per attività libero professionale intramoenia - Area specialistica",0,0]
["BA1230","0702011307","Compartecipazione al personale per attività libero professionale intramoenia - Area sanità pubblica",-18048.23,-14348.49]
["BA1230","0702011308","Fondo perequativo per attività libero professionale intramoenia - Area sanità pubblica",-1025.46,-885.12]
["BA1240","0702011310","Compartecipazione al personale per attività libero professionale intramoenia - Consulenze (ex art. 55 c. 1 lett. c), d) ed ex art. 57-58)",-355672.03,-570363.78]
["BA1240","0702011311","Fondo perequativo per attività libero. professionale intramoenia - Consulenze (ex art. 55 c. 1 lett. c), d) ed ex art. 57-58)",-15821.31,-8963.52]
["BA1260","0702011316","Compartecipazione al personale per attività libero professionale intramoenia - Altro",-75468.47,-108504.84]
["BA1260","0702011318","Convenzioni per attività libero professionale intramoenia - Altro",0,0]
["BA1290","0702011401","Contributi ad associazioni di volontariato",-326600,-349365.76000000001]
["BA1300","0702011402","Rimborsi per cure all'estero",0,-2069.39]
["BA1330","0702011407","Quota 3,5% a servizi veterinari della regione D.lgs 432/98",-9109.51,-8436.8700000000008]
["BA1330","0702011408","Quota 0,5% a laboratori nazionali D.lgs 432/98",-2495.91,-1512.17]
["BA1330","0702011410","Sussidi nefropatici",-182089.94,-168964.21]
["BA1330","0702011411","Contributi e sussidi per disabili psichici",-985172.98,-1364299.34]
["BA1330","0702011412","Altri rimborsi, assegni e contributi",-245640.11,-249313.04]
["BA1340","0702011413","Rimborsi, assegni e contributi v/Aziende sanitarie pubbliche della Regione",-80,0]
["BA1360","0702011501","Consulenze sanitarie e sociosanitarie da Aziende sanitarie pubbliche della Regione",-298526.69,-416373.3]
["BA1370","0702011502","Consulenze sanitarie e sociosanitarie da terzi - Altri soggetti pubblici",-24433.75,0]
["BA1390","0702011503","Consulenze sanitarie da privato - articolo 55, comma 2, CCNL 8 giugno 2000",-2372315.1800000002,-2164804.17]
["BA1400","0702011504","Altre consulenze sanitarie e sociosanitarie da privato",0,-864.76]
["BA1400","0702011505","Consulenze sanitarie e sociosanitarie da privato",-8005.29,-3516.95]
["BA1410","0702011509","Collaborazioni coordinate e continuative sanitarie e sociosanitarie da privato",-8413.1200000000008,0]
["BA1420","0702011510","Indennità a personale universitario - area sanitaria",-242210.34,-256736.03]
["BA1430","0702011511","Lavoro interinale - area sanitaria",-2608784.9,-2862789.15]
["BA1440","0702011515","Altre collaborazioni e prestazioni di lavoro - area sanitaria",-1378.08,-86.13]
["BA1440","0702011516","Personale tirocinante compresi oneri riflessi",-6991.39,-4295.41]
["BA1440","0702011517","Borsisti compresi oneri riflessi",-1024154.57,-704958.07]
["BA1440","0702011518","Personale religioso adibito a mansioni sanitarie ",-47362.36,-34465.339999999997]
["BA1440","0702011519","Medicina penitenziaria",-70885.7,-71961.81]
["BA1480","0702011522","Rimborso oneri stipendiali personale sanitario in comando da aziende di altre Regioni (Extraregione)",-9790.09,-53987.92]
["BA1500","0702011601","Altri servizi sanitari e sociosanitari a rilevanza sanitaria da pubblico - Aziende sanitarie pubbliche della Regione",-13109.54,0]
["BA1530","0702011604","Altri servizi sanitari da privato",-2741606.08,-3534647.28]
["BA1540","0702011605","Costi per servizi sanitari - Mobilità internazionale passiva",0,-2072369.5]
["BA1580","0702020101","Lavanderia",-5274953.32,-4633285.6399999997]
["BA1590","0702020102","Pulizia",-6089443.3399999999,-6110953.9000000004]
["BA1600","0702020103","Mensa",-4117793.49,-4253494.91]
["BA1610","0702020104","Riscaldamento",-1064233.96,-912590.81]
["BA1620","0702020105","Servizi di assistenza informatica",-1666759.65,-1812783.81]
["BA1630","0702020106","Servizi trasporti (non sanitari)",-9272,-5892.6]
["BA1640","0702020107","Smaltimento rifiuti sanitari assimilati e assimilabili agli urbani",-15089.56,-1880.36]
["BA1640","0702020108","Smaltimento rifiuti sanitari speciali",-1369549.07,-1390145.46]
["BA1650","0702020109","Utenze telefoniche",-524835.69999999995,-940270.67]
["BA1660","0702020110","Utenze elettricità",-3156167.9,-3337366.78]
["BA1670","0702020111","Altre utenze",-705877.73,-875740.52]
["BA1690","0702020112","Premi di assicurazione - R.C. Professionale",-4466553.17,-4450699.8499999996]
["BA1700","0702020113","Premi di assicurazione per rischi su immobili",-149871,-97500]
["BA1700","0702020114","Premi di assicurazione RC automezzi",-56926,-66747.25]
["BA1700","0702020115","Premi di assicurazione altri premi di assicurazione",-136665.87,-113670]
["BA1740","0702020118","Servizio di vigilanza e sicurezza",-1862266.45,-1895343.19]
["BA1740","0702020119","Altri servizi appaltati",-4379343.09,-4138097.74]
["BA1740","0702020120","Spese di rappresentanza",-949,-181]
["BA1740","0702020121","Spese postali",-251509.11,-354747.32]
["BA1740","0702020122","Quote per spese condominiali",-21247.49,-32959.089999999997]
["BA1740","0702020123","Spese legali",-85408.79,-77880.800000000003]
["BA1740","0702020124","Bolli e marchi",-58649.21,-55127.95]
["BA1740","0702020125","Abbonamenti, riviste e libri",-37522.53,-21856.82]
["BA1740","0702020126","Spese per liti, arbitraggi e risarcimenti",0,-72]
["BA1740","0702020127","Altri servizi non sanitari da privato",-37851.33,-45140]
["BA1740","0702020130","Rimborsi spese personale del ruolo sanitario comparto",-41.6,0]
["BA1790","0702020204","Consulenze tecniche",-37124.1,-70269.509999999995]
["BA1790","0702020205","Consulenze legali",-481583.35,-327809.81]
["BA1790","0702020206","Altre consulenze non sanitarie",0,-34447.33]
["BA1800","0702020215","Collaborazioni coordinate e continuative non sanitarie da privato - ruolo amministrativo",-13535.39,-31178.34]
["BA1830","0702020223","Personale religioso adibito a mansioni non sanitarie",-117382.06,-128297.41]
["BA1890","0702020301","Formazione (esternalizzata e non) da pubblico",-81237.64,-35012.980000000003]
["BA1900","0702020302","Formazione (esternalizzata e non) da privato",-516106.58,-626252.09]
["BA1920","0703010101","Manutenzione e riparazione ai fabbricati e loro pertinenze immobili istituzionali o indisponibili",-9244877.5800000001,-8571730.1999999993]
["BA1940","0703030101","Manutenzione e riparazione alle attrezzature sanitarie e scientifiche",-5502395.79,-6129147.0499999998]
["BA1960","0703050101","Manutenzione e riparazione agli automezzi",-109400.27,-125986.4]
["BA1970","0703060101","Altre manutenzioni e riparazioni",-873012.59,-883986.33]
["BA2000","0704010101","Fitti passivi ",-1239352.47,-1330887.46]
["BA2020","0704020102","Canoni di noleggio - area sanitaria - attrezzature sanitarie",-4751723.95,-4981101.3600000003]
["BA2020","0704020103","Altri canoni di noleggio  area sanitaria",-39136.379999999997,-34526]
["BA2030","0704020201","Canoni di noleggio - area non sanitaria - automezzi non sanitari",-174606.61,-138980.71]
["BA2030","0704020202","Canoni di noleggio - area non sanitaria - attrezzature non sanitarie",-287452.83,-290987.26]
["BA2120","0705010101","Costo del personale dirigente medico - tempo indeterminato - Competenze fisse",-45055572.140000001,-43374913.770000003]
["BA2120","0705010102","Costo del personale dirigente medico - tempo indeterminato - Indennità variabili",-1455417.41,-1448634.79]
["BA2120","0705010103","Costo del personale dirigente medico - tempo indeterminato - Premi e Incentivazioni",-3664763.14,-3802287.61]
["BA2120","0705010104","Costo del personale dirigente medico - tempo indeterminato - Straordinario",-925521.32,-919074.42]
["BA2120","0705010105","Costo del personale dirigente medico - tempo indeterminato - Oneri Sociali",-15117441.619999999,-14746781.140000001]
["BA2120","0705010107","Costo del personale dirigente medico - tempo indeterminato - Altri costi del personale",-24463.24,-27550.05]
["BA2130","0705010108","Costo del personale dirigente medico (non art. 15-septies D.Lgs. 502/92)- tempo determinato - Competenze fisse",-1365651.13,-2200815]
["BA2130","0705010109","Costo del personale dirigente medico (non art. 15-septies D.Lgs. 502/92)- tempo determinato - Indennità variabili",-73345.960000000006,-102491.02]
["BA2130","0705010110","Costo del personale dirigente medico (non art. 15-septies D.Lgs. 502/92)- tempo determinato - Premi e Incentivazioni",-10124.530000000001,-11385.88]
["BA2130","0705010111","Costo del personale dirigente medico (non art. 15-septies D.Lgs. 502/92)- tempo determinato - Straordinario",-43484.84,-55328.32]
["BA2130","0705010112","Costo del personale dirigente medico (non art. 15-septies D.Lgs. 502/92)- tempo determinato - Oneri Sociali",-413029.84,-660634.39]
["BA2130","0705010114","Costo del personale dirigente medico (non art. 15-septies D.Lgs. 502/92)- tempo determinato - Altri costi del personale",-44.02,-1974.33]
["BA2160","0705010201","Costo del personale dirigente non medico - tempo indeterminato - Competenze fisse",-3736100.03,-3521279.86]
["BA2160","0705010202","Costo del personale dirigente non medico - tempo indeterminato - Indennità variabili",-10911.04,-9170.7999999999993]
["BA2160","0705010203","Costo del personale dirigente non medico - tempo indeterminato - Premi e Incentivazioni",-168195.78,-226151.56]
["BA2160","0705010204","Costo del personale dirigente non medico - tempo indeterminato - Straordinario",-89673.54,-65596.27]
["BA2160","0705010205","Costo del personale dirigente non medico - tempo indeterminato - Oneri Sociali",-1059409.8600000001,-1007940.26]
["BA2160","0705010207","Costo del personale dirigente non medico - tempo indeterminato - Altri costi del personale",-227.76,-1133.74]
["BA2170","0705010208","Costo del personale dirigente non medico (non art. 15-septies D.Lgs. 502/92)- tempo determinato - Competenze fisse",-35987.56,-256666.86]
["BA2170","0705010210","Costo del personale dirigente non medico (non art. 15-septies D.Lgs. 502/92)- tempo determinato - Premi e Incentivazioni",0,0]
["BA2170","0705010212","Costo del personale dirigente non medico (non art. 15-septies D.Lgs. 502/92)- tempo determinato - Oneri Sociali",-9485.51,-72214.460000000006]
["BA2170","0705010216","Costo del personale dirigente non medico art. 15-septies D.Lgs. 502/92- tempo determinato - Competenze fisse",-46315.19,-46315.91]
["BA2170","0705010217","Costo del personale dirigente non medico art. 15-septies D.Lgs. 502/92- tempo determinato - Indennità variabili",-20.66,0]
["BA2170","0705010218","Costo del personale dirigente non medico art. 15-septies D.Lgs. 502/92- tempo determinato - Premi e Incentivazioni",0,0]
["BA2170","0705010220","Costo del personale dirigente non medico art. 15-septies D.Lgs. 502/92- tempo determinato - Oneri Sociali",-13087.6,-13082.45]
["BA2200","0705020101","Costo del personale comparto ruolo sanitario - tempo indeterminato - Competenze fisse",-44536560.390000001,-45403639.130000003]
["BA2200","0705020102","Costo del personale comparto ruolo sanitario - tempo indeterminato - Indennità variabili",-3120224.68,-3108448.35]
["BA2200","0705020103","Costo del personale comparto ruolo sanitario - tempo indeterminato - Premi e Incentivazioni",-1987825.16,-2286325.67]
["BA2200","0705020104","Costo del personale comparto ruolo sanitario - tempo indeterminato - Straordinario",-1044373.28,-1013608.82]
["BA2200","0705020105","Costo del personale comparto ruolo sanitario - tempo indeterminato - Oneri Sociali",-13345209.789999999,-13690391.57]
["BA2200","0705020107","Costo del personale comparto ruolo sanitario - tempo indeterminato - Altri costi del personale",-10316.01,-11748.97]
["BA2210","0705020201","Costo del personale comparto ruolo sanitario - tempo determinato - Competenze fisse",-572559.28,-1228490.2]
["BA2210","0705020202","Costo del personale comparto ruolo sanitario - tempo determinato - Indennità variabili",-58186.33,-119445.35]
["BA2210","0705020203","Costo del personale comparto ruolo sanitario - tempo determinato - Premi e Incentivazioni",-10,-10]
["BA2210","0705020204","Costo del personale comparto ruolo sanitario - tempo determinato - Straordinario",-4531.76,-11103.58]
["BA2210","0705020205","Costo del personale comparto ruolo sanitario - tempo determinato - Oneri Sociali",-177148.29,-375916.61]
["BA2250","0706010101","Costo del personale dirigente ruolo professionale - tempo indeterminato - Competenze fisse",-269048.68,-235881.96]
["BA2250","0706010102","Costo del personale dirigente ruolo professionale - tempo indeterminato - Indennità variabili",-1968.27,-5667.58]
["BA2250","0706010103","Costo del personale dirigente ruolo professionale - tempo indeterminato - Premi e Incentivazioni",-51671.1,-51857.94]
["BA2250","0706010105","Costo del personale dirigente ruolo professionale - tempo indeterminato - Oneri Sociali",-81986.27,-74246.63]
["BA2260","0706010201","Costo del personale dirigente ruolo professionale (non art. 15-septies D.Lgs. 502/92)- tempo determinato - Competenze fisse",0,0]
["BA2260","0706010205","Costo del personale dirigente ruolo professionale (non art. 15-septies D.Lgs. 502/92)- tempo determinato - Oneri Sociali",0,0]
["BA2260","0706010208","Costo del personale dirigente ruolo professionale art. 15-septies D.Lgs. 502/92- tempo determinato - Competenze fisse",-15758.96,-51325.55]
["BA2260","0706010209","Costo del personale dirigente ruolo professionale art. 15-septies D.Lgs. 502/92- tempo determinato - Indennità variabili",-723.03,-3077.62]
["BA2260","0706010210","Costo del personale dirigente ruolo professionale art. 15-septies D.Lgs. 502/92- tempo determinato - Premi e Incentivazioni",0,0]
["BA2260","0706010211","Costo del personale dirigente ruolo professionale art. 15-septies D.Lgs. 502/92- tempo determinato - Straordinario",0,-93.15]
["BA2260","0706010212","Costo del personale dirigente ruolo professionale art. 15-septies D.Lgs. 502/92- tempo determinato - Oneri Sociali",-4641.8599999999997,-15130.9]
["BA2290","0706020101","Costo del personale comparto ruolo professionale - tempo indeterminato - Competenze fisse",-8038.41,0]
["BA2290","0706020102","Costo del personale comparto ruolo professionale - tempo indeterminato - Indennità variabili",-776.98,0]
["BA2290","0706020103","Costo del personale comparto ruolo professionale - tempo indeterminato - Premi e Incentivazioni",-1016.7,-1276.03]
["BA2290","0706020105","Costo del personale comparto ruolo professionale - tempo indeterminato - Oneri Sociali",-2571.48,-303.7]
["BA2340","0707010101","Costo del personale dirigente ruolo tecnico - tempo indeterminato - Competenze fisse",-234988.73,-211092.7]
["BA2340","0707010103","Costo del personale dirigente ruolo tecnico - tempo indeterminato - Premi e Incentivazioni",-64588.88,-64822.42]
["BA2340","0707010105","Costo del personale dirigente ruolo tecnico - tempo indeterminato - Oneri Sociali",-76161.919999999998,-69787.78]
["BA2380","0707020101","Costo del personale comparto ruolo tecnico - tempo indeterminato - Competenze fisse",-11238015.060000001,-11802699.48]
["BA2380","0707020102","Costo del personale comparto ruolo tecnico - tempo indeterminato - Indennità variabili",-569449.9,-648746.51]
["BA2380","0707020103","Costo del personale comparto ruolo tecnico - tempo indeterminato - Premi e Incentivazioni",-548976.65,-678032.7]
["BA2380","0707020104","Costo del personale comparto ruolo tecnico - tempo indeterminato - Straordinario",-276416.17,-243508.14]
["BA2380","0707020105","Costo del personale comparto ruolo tecnico - tempo indeterminato - Oneri Sociali",-3326919.6,-3504465.99]
["BA2380","0707020107","Costo del personale comparto ruolo tecnico - tempo indeterminato - Altri costi del personale",-3729.59,-4384.6899999999996]
["BA2390","0707020201","Costo del personale comparto ruolo tecnico - tempo determinato - Competenze fisse",-133953.13,-222310.37]
["BA2390","0707020202","Costo del personale comparto ruolo tecnico - tempo determinato - Indennità variabili",-1260.17,-5665.27]
["BA2390","0707020203","Costo del personale comparto ruolo tecnico - tempo determinato - Premi e Incentivazioni",0,0]
["BA2390","0707020204","Costo del personale comparto ruolo tecnico - tempo determinato - Straordinario",-3035.49,-362.78]
["BA2390","0707020205","Costo del personale comparto ruolo tecnico - tempo determinato - Oneri Sociali",-38974.86,-62963.98]
["BA2430","0708010101","Costo del personale dirigente ruolo amministrativo - tempo indeterminato - Competenze fisse",-568273.11,-637949.44999999995]
["BA2430","0708010102","Costo del personale dirigente ruolo amministrativo - tempo indeterminato - Indennità variabili",0,-1.05]
["BA2430","0708010103","Costo del personale dirigente ruolo amministrativo - tempo indeterminato - Premi e Incentivazioni",-77506.649999999994,-77786.899999999994]
["BA2430","0708010105","Costo del personale dirigente ruolo amministrativo - tempo indeterminato - Oneri Sociali",-178444.79,-206727.55]
["BA2440","0708010201","Costo del personale dirigente ruolo amministrativo (non art. 15-septies D.Lgs. 502/92)- tempo determinato - Competenze fisse",0,-11944.62]
["BA2440","0708010202","Costo del personale dirigente ruolo amministrativo (non art. 15-septies D.Lgs. 502/92)- tempo determinato - Indennità variabili",0,-1.05]
["BA2440","0708010204","Costo del personale dirigente ruolo amministrativo (non art. 15-septies D.Lgs. 502/92)- tempo determinato - Straordinario",0,-369]
["BA2440","0708010205","Costo del personale dirigente ruolo amministrativo (non art. 15-septies D.Lgs. 502/92)- tempo determinato - Oneri Sociali",0,-3280.61]
["BA2470","0708020101","Costo del personale comparto ruolo amministrativo - tempo indeterminato - Competenze fisse",-6887917.5099999998,-6671972.8499999996]
["BA2470","0708020102","Costo del personale comparto ruolo amministrativo - tempo indeterminato - Indennità variabili",-2315.64,-2283.5700000000002]
["BA2470","0708020103","Costo del personale comparto ruolo amministrativo - tempo indeterminato - Premi e Incentivazioni",-357940.5,-434508.77]
["BA2470","0708020104","Costo del personale comparto ruolo amministrativo - tempo indeterminato - Straordinario",-86735.4,-99657.4]
["BA2470","0708020105","Costo del personale comparto ruolo amministrativo - tempo indeterminato - Oneri Sociali",-1952572.67,-1912568.33]
["BA2470","0708020107","Costo del personale comparto ruolo amministrativo - tempo indeterminato - Altri costi del personale",-1237.28,-768.14]
["BA2480","0708020201","Costo del personale comparto ruolo amministrativo - tempo determinato - Competenze fisse",1.1399999999999999,-28294.28]
["BA2480","0708020205","Costo del personale comparto ruolo amministrativo - tempo determinato - Oneri Sociali",0,-7998.01]
["BA2480","0708020207","Costo del personale comparto ruolo amministrativo - tempo determinato - Altri costi del personale",-1369.45,-1195]
["BA2510","0709010101","Imposta di registro",-9142,-45747.74]
["BA2510","0709010102","Imposta di bollo",-804,-788]
["BA2510","0709010104","Imposte comunali",-1068235,-1104203]
["BA2510","0709010105","Tasse di circolazione automezzi",-1182.23,0]
["BA2510","0709010106","Altre imposte, tasse e tributi (escluse IRAP e IRES) ",-81211.570000000007,-96418.42]
["BA2540","0709030101","Indennità, rimborso spese e oneri sociali per il Direttore Generale",-148784.1,-137594.71]
["BA2540","0709030102","Indennità, rimborso spese e oneri sociali per il Direttore Amministrativo",-129339.76,-119782.98]
["BA2540","0709030103","Indennità, rimborso spese e oneri sociali per il Direttore Sanitario",-167495.57,-162687.92000000001]
["BA2540","0709030104","Indennità, rimborso spese e oneri sociali per i membri del Collegio sindacale",-44028.17,-42315.360000000001]
["BA2540","0709030105","Indennità, rimborso spese e oneri sociali per i membri delle Commissioni varie",-941039.54,-876525.05]
["BA2550","0709030201","Oneri diversi da decreti ingiuntivi, liti, arbitraggi e risarcimenti",-328.09,-565.77]
["BA2550","0709030202","Oneri diversi derivanti da transazioni",0,0]
["BA2550","0709030203","Altri oneri diversi di gestione",-292556.33,-251369.55]
["BA2570","0710010105","Ammortamento delle altre immobilizzazioni immateriali",-136552.39000000001,-160938.81]
["BA2610","0711020101","Ammortamento fabbricati strumentali (indisponibili)",-4970287.05,-4970458.6100000003]
["BA2620","0712010101","Ammortamento impianti e macchinari",-263002.39,-243006.53]
["BA2620","0712010102","Ammortamento attrezzature sanitarie e scientifiche",-4163720.13,-4807326.2300000004]
["BA2620","0712010103","Ammortamento mobili e arredi",-361188.29,-354383.59]
["BA2620","0712010104","Ammortamento automezzi",-122740.86,-93539.1]
["BA2620","0712010105","Ammortamento altri beni materiali",-244886.65,-251784.97]
["BA2670","0309010401","Rimanenze finali medicinali con AIC",4388956,9637765.4000000004]
["BA2670","0309010402","Rimanenze finali soluzioni infusionali con AIC",1398.76,4720.8100000000004]
["BA2670","0309010403","Rimanenze finali ossigeno con AIC",1633.04,1919.27]
["BA2670","0309010404","Rimanenze finali altri gas medicali con AIC",9993.4599999999991,18281.7]
["BA2670","0309010405","Rimanenze finali emoderivati con AIC",415087.34,299372.46999999997]
["BA2670","0309010406","Rimanenze finali medicinali senza AIC",220505.73,153849.16]
["BA2670","0309010409","Rimanenze finali strumentazione per bioimmagini e radioterapia",22325.73,57070.16]
["BA2670","0309010410","Rimanenze finali materiale per sterilizzazione",44744.42,8572.01]
["BA2670","0309010411","Rimanenze finali dispositivi per chirurgia mini-invasiva ed elettrochirurgia",191192.48,237459.44]
["BA2670","0309010412","Rimanenze finali protesi ortopediche e mezzi per osteosintesi e sintesi tendineo-legamentosa",156988.5,125902.79]
["BA2670","0309010413","Rimanenze finali protesi oculistiche",21294.52,28295.8]
["BA2670","0309010414","Rimanenze finali protesi vascolari e cardiache",7516.08,4904.6400000000003]
["BA2670","0309010415","Rimanenze finali altri dispositivi protesici impiantabili e prodotti per osteosintesi",15680.73,8142.05]
["BA2670","0309010416","Rimanenze finali supporti e ausili tecnici per persone disabili",32718.44,15277.66]
["BA2670","0309010417","Rimanenze finali dispositivi per emotrasfusione ed ematologia",58519.51,43182.99]
["BA2670","0309010418","Rimanenze finali strumentazione per esplorazioni funzionali ed interventi terapeutici",270520.31,349679.38]
["BA2670","0309010419","Rimanenze finali dispositivi per dialisi",78184.86,349609.43]
["BA2670","0309010420","Rimanenze finali strumentazione per radiologia diagnostica ed interventistica",712.51,971.05]
["BA2670","0309010421","Rimanenze finali strumentario chirurgico pluriuso o riusabile",92097.5,59941.67]
["BA2670","0309010422","Rimanenze finali dispositivi medico-diagnostici in vitro (D.Lgs. 332/2000)",1482372.12,1412543.58]
["BA2670","0309010423","Rimanenze finali dispositivi protesici impiantabili - vari",80004.3,36165.230000000003]
["BA2670","0309010424","Rimanenze finali dispositivi per sistema artero-venoso",196661.87,341902.99]
["BA2670","0309010425","Rimanenze finali guide per apparato cardiocircolatorio",16525.53,51496.86]
["BA2670","0309010426","Rimanenze finali prodotti dietetici",5615.65,5237.29]
["BA2670","0309010427","Rimanenze finali alimenti per nutrizione artificiale senza AIC",58004.47,66412.52]
["BA2670","0309010430","Rimanenze finali altri vaccini",1112.76,2856.7]
["BA2670","0309010436","Rimanenze finali vetrerie e materiale plastico per laboratorio",42717.86,22568.66]
["BA2670","0309010437","Rimanenze finali materiali di consumo non specifici per strumentazione diagnostica",125485.73,93627.14]
["BA2670","0309010438","Rimanenze finali altri beni e prodotti sanitari",127988.56,180987.44]
["BA2670","0309010439","Rimanenze finali dispositivi da somministrazione, prelievo e raccolta",569117.94999999995,632496.81999999995]
["BA2670","0309010440","Rimanenze finali dispositivi impiantabili attivi",30319.56,31197.03]
["BA2670","0309010441","Rimanenze finali altri dispositivi per apparato cardiocircolatorio",123103.54,192131.49]
["BA2670","0309010442","Rimanenze finali disinfettanti, antisettici e proteolitici (D.Lgs. 46/97)",22348.48,23214.09]
["BA2670","0309010443","Rimanenze finali dispositivi per apparato gastrointestinale",83693.42,108873.9]
["BA2670","0309010444","Rimanenze finali dispositivi da sutura",349748.67,199430.7]
["BA2670","0309010445","Rimanenze finali dispositivi per sistema nervoso e midollare",28260.43,24648.400000000001]
["BA2670","0309010446","Rimanenze finali dispositivi per odontoiatria, oftalmologoa e otorinolaringoiatria",71817.279999999999,77787.69]
["BA2670","0309010447","Rimanenze finali dispositivi per apparato respiratorio e anestesia",182238.66,226521.29]
["BA2670","0309010448","Rimanenze finali dispositivi di protezione e ausili per incontinenza (D.Lgs. 46/97)",196921.3,188552.61]
["BA2670","0309010449","Rimanenze finali dispositivi per apparato urogenitale",51126.59,58158.49]
["BA2670","0309010450","Rimanenze finali dispositivi vari",304842.71999999997,302955.27]
["BA2670","0309010451","Rimanenze finali dispositivi per medicazioni generali e specialistiche",357449.92,347297.22]
["BA2670","0309010452","Rimanenze finali Farmaci innovativi",796557.79,425624.06]
["BA2670","0714010101","Rimanenze iniziali medicinali con AIC",-4636666.55,-4388956]
["BA2670","0714010102","Rimanenze iniziali soluzioni infusionali con AIC",-1437.61,-1398.76]
["BA2670","0714010103","Rimanenze iniziali ossigeno con AIC",-10294.49,-1633.04]
["BA2670","0714010104","Rimanenze iniziali altri gas medicali con AIC",-2368.85,-9993.4599999999991]
["BA2670","0714010105","Rimanenze iniziali emoderivati con AIC",-298115.40000000002,-415087.34]
["BA2670","0714010106","Rimanenze iniziali medicinali senza AIC",-126880.91,-220505.73]
["BA2670","0714010109","Rimanenze iniziali strumentazione per bioimmagini e radioterapia",0,-22325.73]
["BA2670","0714010110","Rimanenze iniziali materiale per sterilizzazione",-13554.18,-44744.42]
["BA2670","0714010111","Rimanenze iniziali dispositivi per chirurgia mini-invasiva ed elettrochirurgia",-174192.21,-191192.48]
["BA2670","0714010112","Rimanenze iniziali protesi ortopediche e mezzi per osteosintesi e sintesi tendineo-legamentosa",-50150.67,-156988.5]
["BA2670","0714010113","Rimanenze iniziali protesi oculistiche",-24968.06,-21294.52]
["BA2670","0714010114","Rimanenze iniziali protesi vascolari e cardiache",-1839.24,-7516.08]
["BA2670","0714010115","Rimanenze iniziali altri dispositivi protesici impiantabili e prodotti per osteosintesi",-10862.72,-15680.73]
["BA2670","0714010116","Rimanenze iniziali supporti e ausili tecnici per persone disabili",-21594.97,-32718.44]
["BA2670","0714010117","Rimanenze iniziali dispositivi per emotrasfusione ed ematologia",-45796.36,-58519.51]
["BA2670","0714010118","Rimanenze iniziali strumentazione per esplorazioni funzionali ed interventi terapeutici",-104045.91,-270520.31]
["BA2670","0714010119","Rimanenze iniziali dispositivi per dialisi",-179690.46,-78184.86]
["BA2670","0714010120","Rimanenze iniziali strumentazione per radiologia diagnostica ed interventistica",-589.26,-712.51]
["BA2670","0714010121","Rimanenze iniziali strumentario chirurgico pluriuso o riusabile",-55549.760000000002,-92097.5]
["BA2670","0714010122","Rimanenze iniziali dispositivi medico-diagnostici in vitro (D.Lgs. 332/2000)",-1255177.3999999999,-1482372.12]
["BA2670","0714010123","Rimanenze iniziali dispositivi protesici impiantabili  - vari",-28003.05,-80004.3]
["BA2670","0714010124","Rimanenze iniziali dispositivi per sistema artero-venoso",-132460.47,-196661.87]
["BA2670","0714010125","Rimanenze iniziali guide per apparato cardiocircolatorio",-9174.4,-16525.53]
["BA2670","0714010126","Rimanenze iniziali prodotti dietetici",-4508.83,-5615.65]
["BA2670","0714010127","Rimanenze iniziali alimenti per nutrizione artificiale senza AIC",-63760.33,-58004.47]
["BA2670","0714010130","Rimanenze iniziali altri vaccini",0,-1112.76]
["BA2670","0714010136","Rimanenze iniziali vetrerie e materiale plastico per laboratorio",-26506.58,-42717.86]
["BA2670","0714010137","Rimanenze iniziali materiali di consumo non specifici per strumentazione diagnostica",-82188.66,-125485.73]
["BA2670","0714010138","Rimanenze iniziali altri beni e prodotti sanitari",-102717.74,-127988.56]
["BA2670","0714010139","Rimanenze iniziali dispositivi da somministrazione, prelievo e raccolta",-559635.56999999995,-569117.94999999995]
["BA2670","0714010140","Rimanenze iniziali dispositivi impiantabili attivi",-58041,-30319.56]
["BA2670","0714010141","Rimanenze iniziali altri dispositivi per apparato cardiocircolatorio",-124428.45,-123103.54]
["BA2670","0714010142","Rimanenze iniziali disinfettanti, antisettici e proteolitici (D.Lgs. 46/97)",-29235.99,-22348.48]
["BA2670","0714010143","Rimanenze iniziali dispositivi per apparato gastrointestinale",-59952.07,-83693.42]
["BA2670","0714010144","Rimanenze iniziali dispositivi da sutura",-396218.06,-349748.67]
["BA2670","0714010145","Rimanenze iniziali dispositivi per sistema nervoso e midollare",-12511.97,-28260.43]
["BA2670","0714010146","Rimanenze iniziali dispositivi per odontoiatria, oftalmologoa e otorinolaringoiatria",-105207.2,-71817.279999999999]
["BA2670","0714010147","Rimanenze iniziali dispositivi per apparato respiratorio e anestesia",-125642.41,-182238.66]
["BA2670","0714010148","Rimanenze iniziali dispositivi di protezione e ausili per incontinenza (D.Lgs. 46/97)",-212601.7,-196921.3]
["BA2670","0714010149","Rimanenze iniziali dispositivi per apparato urogenitale",-65964.789999999994,-51126.59]
["BA2670","0714010150","Rimanenze iniziali dispositivi vari",-234985.3,-304842.71999999997]
["BA2670","0714010151","Rimanenze iniziali dispositivi per medicazioni generali e specialistiche",-312836.58,-357449.92]
["BA2670","0714010152","Rimanenze iniziali Farmaci innovativi",-406045.08,-796557.79]
["BA2680","0309010602","Rimanenze finali materiali di guardaroba, di pulizia e di convivenza in genere",29727.94,29504.9]
["BA2680","0309010604","Rimanenze finali supporti informatici",192555.39,102147.29]
["BA2680","0309010605","Rimanenze finali cancelleria e stampanti",169734.96,107409.14]
["BA2680","0309010606","Rimanenze finali materiali per la manutenzione di immobili e loro pertinenze",85875.45,139324.97]
["BA2680","0309010608","Rimanenze finali materiali per la manutenzione di attrezzature tecnico scientifiche sanitarie",26463.29,15166.69]
["BA2680","0309010610","Rimanenze finali di materiale per la manutenzione di altro",5031.3999999999996,4064.04]
["BA2680","0309010611","Rimanenze finali altri beni e prodotti non sanitari",1229.74,502.43]
["BA2680","0714020102","Rimanenze iniziali materiali di guardaroba, di pulizia e di convivenza in genere",-35073.03,-29727.94]
["BA2680","0714020104","Rimanenze iniziali supporti informatici",-171772.85,-192555.39]
["BA2680","0714020105","Rimanenze iniziali cancelleria e stampanti",-161363.28,-169734.96]
["BA2680","0714020106","Rimanenze iniziali materiali per la manutenzione di immobili e loro pertinenze",-55250.31,-85875.45]
["BA2680","0714020108","Rimanenze iniziali materiali per la manutenzione di attrezzature tecnico scientifiche sanitarie",-25964.41,-26463.29]
["BA2680","0714020110","Rimanenze iniziali di materiale per la manutenzione di altro",-3934.22,-5031.3999999999996]
["BA2680","0714020111","Rimanenze iniziali altri beni e prodotti non sanitari",-2869.46,-1229.74]
["BA2710","0715010101","Accantonamenti per cause civili ed oneri processuali",-9268206.2400000002,-1357811.38]
["BA2720","0715010102","Accantonamenti per contenzioso personale dipendente",-562892.11,0]
["BA2730","0715010103","Accantonamenti per rischi connessi all'acquisto di prestazioni sanitarie da privato al fondo debiti in contestazione ",-4358962,-272176.8]
["BA2740","0715010104","Accantonamenti per copertura diretta dei rischi (autoassicurazione)",-3111381.31,-2297725.7799999998]
["BA2760","0715020101","Accantonamenti per premio di operosità (SUMAI)",-223015.56,-264664.11]
["BA2780","0715030112","Accantonamenti per quote inutilizzate contributi da Regione per quota Progetti di PSN L 662/96",-7018127.5499999998,-7216729.6299999999]
["BA2790","0715030201","Accantonamenti per quote inutilizzate contributi da soggetti pubblici (extra fondo) vincolati",-50302.400000000001,-53105.86]
["BA2840","0715040201","Accantonamenti rinnovi convenzioni MMG/PLS/MCA",-653733,-1507157]
["BA2850","0715040301","Accantonamenti rinnovi convenzioni medici Sumai",-82934,-200998]
["BA2860","0715040401","Accantonamenti rinnovi contrattuali: dirigenza medica",-757797,-2419388]
["BA2870","0715040501","Accantonamenti rinnovi contrattuali: dirigenza non medica ruolo sanitario ",-56100,-179109]
["BA2870","0715040502","Accantonamenti rinnovi contrattuali: dirigenza non medica ruolo professionale ",-4558,-14551]
["BA2870","0715040503","Accantonamenti rinnovi contrattuali: dirigenza non medica ruolo tecnico ",-5373,-17153]
["BA2870","0715040504","Accantonamenti rinnovi contrattuali: dirigenza non medica ruolo amministrativo ",-8918,-28471]
["BA2880","0715040601","Accantonamenti rinnovi contrattuali: comparto ruolo sanitario ",-725501,0]
["BA2880","0715040602","Accantonamenti rinnovi contrattuali: comparto ruolo professionale ",-543,0]
["BA2880","0715040603","Accantonamenti rinnovi contrattuali: comparto ruolo tecnico ",-177873,0]
["BA2880","0715040604","Accantonamenti rinnovi contrattuali: comparto ruolo amministrativo ",-104410,0]
["BA2890","0715040705","Altri accantonamenti ",-300000,-2400000]
["CA0030","0401020101","Interessi attivi su c/c postali",0,1395.3]
["CA0140","0801030101","Interessi moratori",-157753.12,-1449403.09]
["CA0140","0801030102","Altri interessi passivi",-73.63,0]
["CA0160","0802010101","Altri oneri finanziari",-4522.33,-1932.36]
["EA0060","0601020201","Sopravvenienze attive v/Aziende sanitarie pubbliche della Regione relative alla mobilità intraregionale",1937686,3032781]
["EA0060","0601020202","Altre sopravvenienze attive v/Aziende sanitarie pubbliche della Regione",111766.26,21274.48]
["EA0120","0601020207","Sopravvenienze attive v/terzi relative all'acquisto prestazioni sanitarie da operatori accreditati",2999852.73,2636094.7400000002]
["EA0130","0601020208","Sopravvenienze attive v/terzi relative all'acquisto di beni e servizi",341295.78,468853.64]
["EA0140","0601020209","Sopravvenienze attive per attività libero professionale",0,0]
["EA0140","0601020210","Altre sopravvenienze attive v/terzi",2010658.93,1380885.09]
["EA0220","0601020306","Insussistenze attive v/terzi relative all'acquisto prestazioni sanitarie da operatori accreditati",1672403.91,326389.61]
["EA0230","0601020307","Insussistenze attive v/terzi relative all'acquisto di beni e servizi",288245.17,4775754.84]
["EA0240","0601020308","Altre insussistenze attive v/terzi",125240.07,68794.210000000006]
["EA0270","1001010101","Minusvalenze",0,-19530.05]
["EA0340","1001020302","Altre sopravvenienze passive v/Aziende sanitarie pubbliche della Regione",-134078.51,-122869.51]
["EA0380","1001020304","Sopravvenienze passive v/terzi relative al personale - dirigenza medica",-183240.74,-3919.87]
["EA0390","1001020305","Sopravvenienze passive v/terzi relative al personale - dirigenza non medica",-5333.38,-7520.5]
["EA0400","1001020306","Sopravvenienze passive v/terzi relative al personale - comparto",-363166.05,-2590077.62]
["EA0410","1001020307","Sopravvenienze passive v/terzi relative alle convenzioni con medici di base",0,-2272.9499999999998]
["EA0420","1001020308","Sopravvenienze passive v/terzi relative alle convenzioni per la specialistica",-48576.12,-53207.86]
["EA0430","1001020309","Sopravvenienze passive v/terzi relative all'acquisto prestazioni sanitarie da operatori accreditati",-25282.29,-965342.11]
["EA0440","1001020310","Sopravvenienze passive v/terzi relative all'acquisto di beni e servizi",-2651265.85,-2001061.54]
["EA0450","1001020312","Altre sopravvenienze passive v/terzi",-134394.78,-557030.55000000005]
["EA0530","1001020406","Insussistenze passive v/terzi relative all'acquisto prestazioni sanitarie da operatori accreditati",-832320.62,-907726.79]
["EA0540","1001020407","Insussistenze passive v/terzi relative all'acquisto di beni e servizi",-115363.27,-33658.5]
["EA0550","1001020408","Altre insussistenze passive v/terzi",-76578.070000000007,-171030.37]
["YA0020","1101010101","IRAP relativa al personale dipendente del ruolo sanitario",-9113825.9199999999,-9238555.3100000005]
["YA0020","1101010102","IRAP relativa al personale dipendente del ruolo professionale",-30362.880000000001,-30304.45]
["YA0020","1101010103","IRAP relativa al personale dipendente del ruolo tecnico",-927111.01,-1167590.78]
["YA0020","1101010104","IRAP relativa al personale dipendente del ruolo amministrativo",-563084.71,-672831.92]
["YA0030","1101020101","IRAP relativa a collaboratori e personale assimilato a lavoro dipendente",-272084.52,-346167.93]
["YA0030","1101020102","IRAP relativa ai medici di guardia medica",-145724.37,-180468.96]
["YA0030","1101020103","IRAP relativa ai medici 118",-41456.54,-40527.24]
["YA0030","1101020104","IRAP relativa ad altro (medicina dei servizi, psicologi, etc¿)",-11543.85,-10728.44]
["YA0040","1101030101","IRAP relativa ad attività intramoenia",-275247.39,-261166.86]
["YA0040","1101030102","IRAP libera professione relativa ad attività istituzionale (ex. art. 55 c. 2 CCNL)",-182825.02,-157583.91]
["YA0050","1101040101","IRAP relativa ad attività commerciale",-93278.75,0]
["YA0080","1102020101","IRES su attività commerciale",-490066,-408274]

{"sheet":"00 Aggregatore","index":1,"n_rows":375,"n_cols":6,"rows_kept":375,"cut":false,"hidden":false,"merged":[]}
[]
[null,null,null,null,"ANNO",2018]
[]
["Aggr","CE","Descrizione CE","C/R",{"$f":"IF($F$2=\"\",\"Anno T-1\",\"Esercizio \"&$F$2-1)","v":"Esercizio 2017"},{"$f":"IF($F$2=\"\",\"Anno T\",\"Esercizio \"&$F$2)","v":"Esercizio 2018"}]
[{"$f":"LEFT(B5,1)&D5","v":"AR"},"AA0030","Contributi da Regione o Provincia Autonoma per quota F.S. regionale indistinto","R",{"$f":"IF('00 Aggregatore'!$D5=\"R\",SUMIF('00 Alimenta'!$A:$A,$B5,'00 Alimenta'!D:D),SUMIF('00 Alimenta'!$A:$A,$B5,'00 Alimenta'!D:D)*-1)","v":547765886.61000001},{"$f":"IF('00 Aggregatore'!$D5=\"R\",SUMIF('00 Alimenta'!$A:$A,$B5,'00 Alimenta'!E:E),SUMIF('00 Alimenta'!$A:$A,$B5,'00 Alimenta'!E:E)*-1)","v":555479764.00999999}]
[{"$f":"LEFT(B6,1)&D6","v":"AR"},"AA0040","Contributi da Regione o Provincia Autonoma per quota F.S. regionale vincolato","R",{"$f":"IF('00 Aggregatore'!$D6=\"R\",SUMIF('00 Alimenta'!$A:$A,$B6,'00 Alimenta'!D:D),SUMIF('00 Alimenta'!$A:$A,$B6,'00 Alimenta'!D:D)*-1)","v":14815465.59},{"$f":"IF('00 Aggregatore'!$D6=\"R\",SUMIF('00 Alimenta'!$A:$A,$B6,'00 Alimenta'!E:E),SUMIF('00 Alimenta'!$A:$A,$B6,'00 Alimenta'!E:E)*-1)","v":13764801.84}]
["AR","AA0070","Contributi da Regione o Provincia Autonoma (extra fondo) - Vincolati","R",{"$f":"IF('00 Aggregatore'!$D7=\"R\",SUMIF('00 Alimenta'!$A:$A,$B7,'00 Alimenta'!D:D),SUMIF('00 Alimenta'!$A:$A,$B7,'00 Alimenta'!D:D)*-1)","v":123104.1},{"$f":"IF('00 Aggregatore'!$D7=\"R\",SUMIF('00 Alimenta'!$A:$A,$B7,'00 Alimenta'!E:E),SUMIF('00 Alimenta'!$A:$A,$B7,'00 Alimenta'!E:E)*-1)","v":410404.72}]
["AR","AA0080","Contributi da Regione o Provincia Autonoma (extra fondo) - Risorse aggiuntive da bilancio regionale a titolo di copertura LEA","R",{"$f":"IF('00 Aggregatore'!$D8=\"R\",SUMIF('00 Alimenta'!$A:$A,$B8,'00 Alimenta'!D:D),SUMIF('00 Alimenta'!$A:$A,$B8,'00 Alimenta'!D:D)*-1)","v":0},{"$f":"IF('00 Aggregatore'!$D8=\"R\",SUMIF('00 Alimenta'!$A:$A,$B8,'00 Alimenta'!E:E),SUMIF('00 Alimenta'!$A:$A,$B8,'00 Alimenta'!E:E)*-1)","v":0}]
["AR","AA0090","Contributi da Regione o Provincia Autonoma (extra fondo) - Risorse aggiuntive da bilancio regionale a titolo di copertura extra LEA","R",{"$f":"IF('00 Aggregatore'!$D9=\"R\",SUMIF('00 Alimenta'!$A:$A,$B9,'00 Alimenta'!D:D),SUMIF('00 Alimenta'!$A:$A,$B9,'00 Alimenta'!D:D)*-1)","v":0},{"$f":"IF('00 Aggregatore'!$D9=\"R\",SUMIF('00 Alimenta'!$A:$A,$B9,'00 Alimenta'!E:E),SUMIF('00 Alimenta'!$A:$A,$B9,'00 Alimenta'!E:E)*-1)","v":0}]
["AR","AA0100","Contributi da Regione o Provincia Autonoma (extra fondo) - Altro","R",{"$f":"IF('00 Aggregatore'!$D10=\"R\",SUMIF('00 Alimenta'!$A:$A,$B10,'00 Alimenta'!D:D),SUMIF('00 Alimenta'!$A:$A,$B10,'00 Alimenta'!D:D)*-1)","v":0},{"$f":"IF('00 Aggregatore'!$D10=\"R\",SUMIF('00 Alimenta'!$A:$A,$B10,'00 Alimenta'!E:E),SUMIF('00 Alimenta'!$A:$A,$B10,'00 Alimenta'!E:E)*-1)","v":0}]
["AR","AA0120","Contributi da Aziende sanitarie pubbliche della Regione o Provincia Autonoma (extra fondo) - Vincolati","R",{"$f":"IF('00 Aggregatore'!$D11=\"R\",SUMIF('00 Alimenta'!$A:$A,$B11,'00 Alimenta'!D:D),SUMIF('00 Alimenta'!$A:$A,$B11,'00 Alimenta'!D:D)*-1)","v":0},{"$f":"IF('00 Aggregatore'!$D11=\"R\",SUMIF('00 Alimenta'!$A:$A,$B11,'00 Alimenta'!E:E),SUMIF('00 Alimenta'!$A:$A,$B11,'00 Alimenta'!E:E)*-1)","v":0}]
["AR","AA0130","Contributi da Aziende sanitarie pubbliche della Regione o Provincia Autonoma (extra fondo) - Altro","R",{"$f":"IF('00 Aggregatore'!$D12=\"R\",SUMIF('00 Alimenta'!$A:$A,$B12,'00 Alimenta'!D:D),SUMIF('00 Alimenta'!$A:$A,$B12,'00 Alimenta'!D:D)*-1)","v":0},{"$f":"IF('00 Aggregatore'!$D12=\"R\",SUMIF('00 Alimenta'!$A:$A,$B12,'00 Alimenta'!E:E),SUMIF('00 Alimenta'!$A:$A,$B12,'00 Alimenta'!E:E)*-1)","v":0}]
["AR","AA0150","Contributi da altri soggetti pubblici (extra fondo) - Vincolati","R",{"$f":"IF('00 Aggregatore'!$D13=\"R\",SUMIF('00 Alimenta'!$A:$A,$B13,'00 Alimenta'!D:D),SUMIF('00 Alimenta'!$A:$A,$B13,'00 Alimenta'!D:D)*-1)","v":156684.25},{"$f":"IF('00 Aggregatore'!$D13=\"R\",SUMIF('00 Alimenta'!$A:$A,$B13,'00 Alimenta'!E:E),SUMIF('00 Alimenta'!$A:$A,$B13,'00 Alimenta'!E:E)*-1)","v":168535.25}]
["AR","AA0160","Contributi da altri soggetti pubblici (extra fondo) - Legge 210/92","R",{"$f":"IF('00 Aggregatore'!$D14=\"R\",SUMIF('00 Alimenta'!$A:$A,$B14,'00 Alimenta'!D:D),SUMIF('00 Alimenta'!$A:$A,$B14,'00 Alimenta'!D:D)*-1)","v":0},{"$f":"IF('00 Aggregatore'!$D14=\"R\",SUMIF('00 Alimenta'!$A:$A,$B14,'00 Alimenta'!E:E),SUMIF('00 Alimenta'!$A:$A,$B14,'00 Alimenta'!E:E)*-1)","v":0}]
["AR","AA0170","Contributi da altri soggetti pubblici (extra fondo) - Altro","R",{"$f":"IF('00 Aggregatore'!$D15=\"R\",SUMIF('00 Alimenta'!$A:$A,$B15,'00 Alimenta'!D:D),SUMIF('00 Alimenta'!$A:$A,$B15,'00 Alimenta'!D:D)*-1)","v":0},{"$f":"IF('00 Aggregatore'!$D15=\"R\",SUMIF('00 Alimenta'!$A:$A,$B15,'00 Alimenta'!E:E),SUMIF('00 Alimenta'!$A:$A,$B15,'00 Alimenta'!E:E)*-1)","v":0}]
["AR","AA0190","Contributi da Ministero della Salute per ricerca corrente","R",{"$f":"IF('00 Aggregatore'!$D16=\"R\",SUMIF('00 Alimenta'!$A:$A,$B16,'00 Alimenta'!D:D),SUMIF('00 Alimenta'!$A:$A,$B16,'00 Alimenta'!D:D)*-1)","v":0},{"$f":"IF('00 Aggregatore'!$D16=\"R\",SUMIF('00 Alimenta'!$A:$A,$B16,'00 Alimenta'!E:E),SUMIF('00 Alimenta'!$A:$A,$B16,'00 Alimenta'!E:E)*-1)","v":0}]
["AR","AA0200","Contributi da Ministero della Salute per ricerca finalizzata","R",{"$f":"IF('00 Aggregatore'!$D17=\"R\",SUMIF('00 Alimenta'!$A:$A,$B17,'00 Alimenta'!D:D),SUMIF('00 Alimenta'!$A:$A,$B17,'00 Alimenta'!D:D)*-1)","v":0},{"$f":"IF('00 Aggregatore'!$D17=\"R\",SUMIF('00 Alimenta'!$A:$A,$B17,'00 Alimenta'!E:E),SUMIF('00 Alimenta'!$A:$A,$B17,'00 Alimenta'!E:E)*-1)","v":0}]
["AR","AA0210","Contributi da Regione e altri soggetti pubblici per ricerca","R",{"$f":"IF('00 Aggregatore'!$D18=\"R\",SUMIF('00 Alimenta'!$A:$A,$B18,'00 Alimenta'!D:D),SUMIF('00 Alimenta'!$A:$A,$B18,'00 Alimenta'!D:D)*-1)","v":0},{"$f":"IF('00 Aggregatore'!$D18=\"R\",SUMIF('00 Alimenta'!$A:$A,$B18,'00 Alimenta'!E:E),SUMIF('00 Alimenta'!$A:$A,$B18,'00 Alimenta'!E:E)*-1)","v":0}]
["AR","AA0220","Contributi da privati per ricerca","R",{"$f":"IF('00 Aggregatore'!$D19=\"R\",SUMIF('00 Alimenta'!$A:$A,$B19,'00 Alimenta'!D:D),SUMIF('00 Alimenta'!$A:$A,$B19,'00 Alimenta'!D:D)*-1)","v":0},{"$f":"IF('00 Aggregatore'!$D19=\"R\",SUMIF('00 Alimenta'!$A:$A,$B19,'00 Alimenta'!E:E),SUMIF('00 Alimenta'!$A:$A,$B19,'00 Alimenta'!E:E)*-1)","v":0}]
["AR","AA0230","Contributi c/esercizio da privati","R",{"$f":"IF('00 Aggregatore'!$D20=\"R\",SUMIF('00 Alimenta'!$A:$A,$B20,'00 Alimenta'!D:D),SUMIF('00 Alimenta'!$A:$A,$B20,'00 Alimenta'!D:D)*-1)","v":0},{"$f":"IF('00 Aggregatore'!$D20=\"R\",SUMIF('00 Alimenta'!$A:$A,$B20,'00 Alimenta'!E:E),SUMIF('00 Alimenta'!$A:$A,$B20,'00 Alimenta'!E:E)*-1)","v":0}]
["AR","AA0250","Rettifica contributi in c/esercizio per destinazione ad investimenti - da Regione o Provincia Autonoma per quota F.S. regionale","R",{"$f":"IF('00 Aggregatore'!$D21=\"R\",SUMIF('00 Alimenta'!$A:$A,$B21,'00 Alimenta'!D:D),SUMIF('00 Alimenta'!$A:$A,$B21,'00 Alimenta'!D:D)*-1)","v":-6506318.8899999997},{"$f":"IF('00 Aggregatore'!$D21=\"R\",SUMIF('00 Alimenta'!$A:$A,$B21,'00 Alimenta'!E:E),SUMIF('00 Alimenta'!$A:$A,$B21,'00 Alimenta'!E:E)*-1)","v":-4347846.8099999996}]
["AR","AA0260","Rettifica contributi in c/esercizio per destinazione ad investimenti - Altri contributi","R",{"$f":"IF('00 Aggregatore'!$D22=\"R\",SUMIF('00 Alimenta'!$A:$A,$B22,'00 Alimenta'!D:D),SUMIF('00 Alimenta'!$A:$A,$B22,'00 Alimenta'!D:D)*-1)","v":0},{"$f":"IF('00 Aggregatore'!$D22=\"R\",SUMIF('00 Alimenta'!$A:$A,$B22,'00 Alimenta'!E:E),SUMIF('00 Alimenta'!$A:$A,$B22,'00 Alimenta'!E:E)*-1)","v":0}]
["AR","AA0280","Utilizzo fondi per quote inutilizzate contributi di esercizi precedenti da Regione o Provincia Autonoma per quota F.S. regionale vincolato","R",{"$f":"IF('00 Aggregatore'!$D23=\"R\",SUMIF('00 Alimenta'!$A:$A,$B23,'00 Alimenta'!D:D),SUMIF('00 Alimenta'!$A:$A,$B23,'00 Alimenta'!D:D)*-1)","v":5681020.0999999996},{"$f":"IF('00 Aggregatore'!$D23=\"R\",SUMIF('00 Alimenta'!$A:$A,$B23,'00 Alimenta'!E:E),SUMIF('00 Alimenta'!$A:$A,$B23,'00 Alimenta'!E:E)*-1)","v":8070784.3200000003}]
["AR","AA0290","Utilizzo fondi per quote inutilizzate contributi di esercizi precedenti da soggetti pubblici (extra fondo) vincolati","R",{"$f":"IF('00 Aggregatore'!$D24=\"R\",SUMIF('00 Alimenta'!$A:$A,$B24,'00 Alimenta'!D:D),SUMIF('00 Alimenta'!$A:$A,$B24,'00 Alimenta'!D:D)*-1)","v":92452.46},{"$f":"IF('00 Aggregatore'!$D24=\"R\",SUMIF('00 Alimenta'!$A:$A,$B24,'00 Alimenta'!E:E),SUMIF('00 Alimenta'!$A:$A,$B24,'00 Alimenta'!E:E)*-1)","v":0}]
["AR","AA0300","Utilizzo fondi per quote inutilizzate contributi di esercizi precedenti per ricerca","R",{"$f":"IF('00 Aggregatore'!$D25=\"R\",SUMIF('00 Alimenta'!$A:$A,$B25,'00 Alimenta'!D:D),SUMIF('00 Alimenta'!$A:$A,$B25,'00 Alimenta'!D:D)*-1)","v":0},{"$f":"IF('00 Aggregatore'!$D25=\"R\",SUMIF('00 Alimenta'!$A:$A,$B25,'00 Alimenta'!E:E),SUMIF('00 Alimenta'!$A:$A,$B25,'00 Alimenta'!E:E)*-1)","v":0}]
["AR","AA0310","Utilizzo fondi per quote inutilizzate contributi vincolati di esercizi precedenti da privati","R",{"$f":"IF('00 Aggregatore'!$D26=\"R\",SUMIF('00 Alimenta'!$A:$A,$B26,'00 Alimenta'!D:D),SUMIF('00 Alimenta'!$A:$A,$B26,'00 Alimenta'!D:D)*-1)","v":0},{"$f":"IF('00 Aggregatore'!$D26=\"R\",SUMIF('00 Alimenta'!$A:$A,$B26,'00 Alimenta'!E:E),SUMIF('00 Alimenta'!$A:$A,$B26,'00 Alimenta'!E:E)*-1)","v":0}]
["AR","AA0350","Prestazioni di ricovero","R",{"$f":"IF('00 Aggregatore'!$D27=\"R\",SUMIF('00 Alimenta'!$A:$A,$B27,'00 Alimenta'!D:D),SUMIF('00 Alimenta'!$A:$A,$B27,'00 Alimenta'!D:D)*-1)","v":62109937.310000002},{"$f":"IF('00 Aggregatore'!$D27=\"R\",SUMIF('00 Alimenta'!$A:$A,$B27,'00 Alimenta'!E:E),SUMIF('00 Alimenta'!$A:$A,$B27,'00 Alimenta'!E:E)*-1)","v":63932152.799999997}]
["AR","AA0360","Prestazioni di specialistica ambulatoriale","R",{"$f":"IF('00 Aggregatore'!$D28=\"R\",SUMIF('00 Alimenta'!$A:$A,$B28,'00 Alimenta'!D:D),SUMIF('00 Alimenta'!$A:$A,$B28,'00 Alimenta'!D:D)*-1)","v":8188514.2599999998},{"$f":"IF('00 Aggregatore'!$D28=\"R\",SUMIF('00 Alimenta'!$A:$A,$B28,'00 Alimenta'!E:E),SUMIF('00 Alimenta'!$A:$A,$B28,'00 Alimenta'!E:E)*-1)","v":8495470.6699999999}]
["AR","AA0370","Prestazioni di psichiatria residenziale e semiresidenziale","R",{"$f":"IF('00 Aggregatore'!$D29=\"R\",SUMIF('00 Alimenta'!$A:$A,$B29,'00 Alimenta'!D:D),SUMIF('00 Alimenta'!$A:$A,$B29,'00 Alimenta'!D:D)*-1)","v":4556497.3099999996},{"$f":"IF('00 Aggregatore'!$D29=\"R\",SUMIF('00 Alimenta'!$A:$A,$B29,'00 Alimenta'!E:E),SUMIF('00 Alimenta'!$A:$A,$B29,'00 Alimenta'!E:E)*-1)","v":4667985.8600000003}]
["AR","AA0380","Prestazioni di File F","R",{"$f":"IF('00 Aggregatore'!$D30=\"R\",SUMIF('00 Alimenta'!$A:$A,$B30,'00 Alimenta'!D:D),SUMIF('00 Alimenta'!$A:$A,$B30,'00 Alimenta'!D:D)*-1)","v":13565690.02},{"$f":"IF('00 Aggregatore'!$D30=\"R\",SUMIF('00 Alimenta'!$A:$A,$B30,'00 Alimenta'!E:E),SUMIF('00 Alimenta'!$A:$A,$B30,'00 Alimenta'!E:E)*-1)","v":13551276.25}]
["AR","AA0390","Prestazioni servizi MMG, PLS, Continuità assistenziale","R",{"$f":"IF('00 Aggregatore'!$D31=\"R\",SUMIF('00 Alimenta'!$A:$A,$B31,'00 Alimenta'!D:D),SUMIF('00 Alimenta'!$A:$A,$B31,'00 Alimenta'!D:D)*-1)","v":57455.65},{"$f":"IF('00 Aggregatore'!$D31=\"R\",SUMIF('00 Alimenta'!$A:$A,$B31,'00 Alimenta'!E:E),SUMIF('00 Alimenta'!$A:$A,$B31,'00 Alimenta'!E:E)*-1)","v":76930.02}]
["AR","AA0400","Prestazioni servizi farmaceutica convenzionata","R",{"$f":"IF('00 Aggregatore'!$D32=\"R\",SUMIF('00 Alimenta'!$A:$A,$B32,'00 Alimenta'!D:D),SUMIF('00 Alimenta'!$A:$A,$B32,'00 Alimenta'!D:D)*-1)","v":1531007.26},{"$f":"IF('00 Aggregatore'!$D32=\"R\",SUMIF('00 Alimenta'!$A:$A,$B32,'00 Alimenta'!E:E),SUMIF('00 Alimenta'!$A:$A,$B32,'00 Alimenta'!E:E)*-1)","v":1554303.34}]
["AR","AA0410","Prestazioni termali","R",{"$f":"IF('00 Aggregatore'!$D33=\"R\",SUMIF('00 Alimenta'!$A:$A,$B33,'00 Alimenta'!D:D),SUMIF('00 Alimenta'!$A:$A,$B33,'00 Alimenta'!D:D)*-1)","v":1104099.8899999999},{"$f":"IF('00 Aggregatore'!$D33=\"R\",SUMIF('00 Alimenta'!$A:$A,$B33,'00 Alimenta'!E:E),SUMIF('00 Alimenta'!$A:$A,$B33,'00 Alimenta'!E:E)*-1)","v":1071238.47}]
["AR","AA0420","Prestazioni trasporto ambulanze ed elisoccorso","R",{"$f":"IF('00 Aggregatore'!$D34=\"R\",SUMIF('00 Alimenta'!$A:$A,$B34,'00 Alimenta'!D:D),SUMIF('00 Alimenta'!$A:$A,$B34,'00 Alimenta'!D:D)*-1)","v":175653.51},{"$f":"IF('00 Aggregatore'!$D34=\"R\",SUMIF('00 Alimenta'!$A:$A,$B34,'00 Alimenta'!E:E),SUMIF('00 Alimenta'!$A:$A,$B34,'00 Alimenta'!E:E)*-1)","v":176712.63}]
["AR","AA0430","Altre prestazioni sanitarie e socio-sanitarie a rilevanza sanitaria","R",{"$f":"IF('00 Aggregatore'!$D35=\"R\",SUMIF('00 Alimenta'!$A:$A,$B35,'00 Alimenta'!D:D),SUMIF('00 Alimenta'!$A:$A,$B35,'00 Alimenta'!D:D)*-1)","v":5392204.3799999999},{"$f":"IF('00 Aggregatore'!$D35=\"R\",SUMIF('00 Alimenta'!$A:$A,$B35,'00 Alimenta'!E:E),SUMIF('00 Alimenta'!$A:$A,$B35,'00 Alimenta'!E:E)*-1)","v":5984310.9699999997}]
["AR","AA0440","Ricavi per prestazioni sanitarie e socio-sanitarie a rilevanza sanitaria erogate ad altri soggetti pubblici","R",{"$f":"IF('00 Aggregatore'!$D36=\"R\",SUMIF('00 Alimenta'!$A:$A,$B36,'00 Alimenta'!D:D),SUMIF('00 Alimenta'!$A:$A,$B36,'00 Alimenta'!D:D)*-1)","v":45364.98},{"$f":"IF('00 Aggregatore'!$D36=\"R\",SUMIF('00 Alimenta'!$A:$A,$B36,'00 Alimenta'!E:E),SUMIF('00 Alimenta'!$A:$A,$B36,'00 Alimenta'!E:E)*-1)","v":90381.5}]
["AR","AA0460","Prestazioni di ricovero","R",{"$f":"IF('00 Aggregatore'!$D37=\"R\",SUMIF('00 Alimenta'!$A:$A,$B37,'00 Alimenta'!D:D),SUMIF('00 Alimenta'!$A:$A,$B37,'00 Alimenta'!D:D)*-1)","v":1554681.22},{"$f":"IF('00 Aggregatore'!$D37=\"R\",SUMIF('00 Alimenta'!$A:$A,$B37,'00 Alimenta'!E:E),SUMIF('00 Alimenta'!$A:$A,$B37,'00 Alimenta'!E:E)*-1)","v":7320391.0700000003}]
["AR","AA0470","Prestazioni ambulatoriali","R",{"$f":"IF('00 Aggregatore'!$D38=\"R\",SUMIF('00 Alimenta'!$A:$A,$B38,'00 Alimenta'!D:D),SUMIF('00 Alimenta'!$A:$A,$B38,'00 Alimenta'!D:D)*-1)","v":851774.85},{"$f":"IF('00 Aggregatore'!$D38=\"R\",SUMIF('00 Alimenta'!$A:$A,$B38,'00 Alimenta'!E:E),SUMIF('00 Alimenta'!$A:$A,$B38,'00 Alimenta'!E:E)*-1)","v":1477229.91}]
["AR","AA0480","Prestazioni di psichiatria non soggetta a compensazione (residenziale e semiresidenziale)","R",{"$f":"IF('00 Aggregatore'!$D39=\"R\",SUMIF('00 Alimenta'!$A:$A,$B39,'00 Alimenta'!D:D),SUMIF('00 Alimenta'!$A:$A,$B39,'00 Alimenta'!D:D)*-1)","v":0},{"$f":"IF('00 Aggregatore'!$D39=\"R\",SUMIF('00 Alimenta'!$A:$A,$B39,'00 Alimenta'!E:E),SUMIF('00 Alimenta'!$A:$A,$B39,'00 Alimenta'!E:E)*-1)","v":0}]
["AR","AA0490","Prestazioni di File F","R",{"$f":"IF('00 Aggregatore'!$D40=\"R\",SUMIF('00 Alimenta'!$A:$A,$B40,'00 Alimenta'!D:D),SUMIF('00 Alimenta'!$A:$A,$B40,'00 Alimenta'!D:D)*-1)","v":1604980.14},{"$f":"IF('00 Aggregatore'!$D40=\"R\",SUMIF('00 Alimenta'!$A:$A,$B40,'00 Alimenta'!E:E),SUMIF('00 Alimenta'!$A:$A,$B40,'00 Alimenta'!E:E)*-1)","v":2471453.08}]
["AR","AA0500","Prestazioni servizi MMG, PLS, Continuità assistenziale extra Regione","R",{"$f":"IF('00 Aggregatore'!$D41=\"R\",SUMIF('00 Alimenta'!$A:$A,$B41,'00 Alimenta'!D:D),SUMIF('00 Alimenta'!$A:$A,$B41,'00 Alimenta'!D:D)*-1)","v":119388.84},{"$f":"IF('00 Aggregatore'!$D41=\"R\",SUMIF('00 Alimenta'!$A:$A,$B41,'00 Alimenta'!E:E),SUMIF('00 Alimenta'!$A:$A,$B41,'00 Alimenta'!E:E)*-1)","v":56122.64}]
["AR","AA0510","Prestazioni servizi farmaceutica convenzionata extra Regione","R",{"$f":"IF('00 Aggregatore'!$D42=\"R\",SUMIF('00 Alimenta'!$A:$A,$B42,'00 Alimenta'!D:D),SUMIF('00 Alimenta'!$A:$A,$B42,'00 Alimenta'!D:D)*-1)","v":502038.11},{"$f":"IF('00 Aggregatore'!$D42=\"R\",SUMIF('00 Alimenta'!$A:$A,$B42,'00 Alimenta'!E:E),SUMIF('00 Alimenta'!$A:$A,$B42,'00 Alimenta'!E:E)*-1)","v":506661.23}]
["AR","AA0520","Prestazioni termali extra Regione","R",{"$f":"IF('00 Aggregatore'!$D43=\"R\",SUMIF('00 Alimenta'!$A:$A,$B43,'00 Alimenta'!D:D),SUMIF('00 Alimenta'!$A:$A,$B43,'00 Alimenta'!D:D)*-1)","v":172275.4},{"$f":"IF('00 Aggregatore'!$D43=\"R\",SUMIF('00 Alimenta'!$A:$A,$B43,'00 Alimenta'!E:E),SUMIF('00 Alimenta'!$A:$A,$B43,'00 Alimenta'!E:E)*-1)","v":180073.68}]
["AR","AA0530","Prestazioni trasporto ambulanze ed elisoccorso extra Regione","R",{"$f":"IF('00 Aggregatore'!$D44=\"R\",SUMIF('00 Alimenta'!$A:$A,$B44,'00 Alimenta'!D:D),SUMIF('00 Alimenta'!$A:$A,$B44,'00 Alimenta'!D:D)*-1)","v":512404.02},{"$f":"IF('00 Aggregatore'!$D44=\"R\",SUMIF('00 Alimenta'!$A:$A,$B44,'00 Alimenta'!E:E),SUMIF('00 Alimenta'!$A:$A,$B44,'00 Alimenta'!E:E)*-1)","v":469730.81}]
["AR","AA0540","Altre prestazioni sanitarie e socio-sanitarie a rilevanza sanitaria extra Regione","R",{"$f":"IF('00 Aggregatore'!$D45=\"R\",SUMIF('00 Alimenta'!$A:$A,$B45,'00 Alimenta'!D:D),SUMIF('00 Alimenta'!$A:$A,$B45,'00 Alimenta'!D:D)*-1)","v":0},{"$f":"IF('00 Aggregatore'!$D45=\"R\",SUMIF('00 Alimenta'!$A:$A,$B45,'00 Alimenta'!E:E),SUMIF('00 Alimenta'!$A:$A,$B45,'00 Alimenta'!E:E)*-1)","v":0}]
["AR","AA0550","Ricavi per cessione di emocomponenti e cellule staminali extra Regione","R",{"$f":"IF('00 Aggregatore'!$D46=\"R\",SUMIF('00 Alimenta'!$A:$A,$B46,'00 Alimenta'!D:D),SUMIF('00 Alimenta'!$A:$A,$B46,'00 Alimenta'!D:D)*-1)","v":174766.05},{"$f":"IF('00 Aggregatore'!$D46=\"R\",SUMIF('00 Alimenta'!$A:$A,$B46,'00 Alimenta'!E:E),SUMIF('00 Alimenta'!$A:$A,$B46,'00 Alimenta'!E:E)*-1)","v":0}]
["AR","AA0560","Ricavi per differenziale tariffe TUC","R",{"$f":"IF('00 Aggregatore'!$D47=\"R\",SUMIF('00 Alimenta'!$A:$A,$B47,'00 Alimenta'!D:D),SUMIF('00 Alimenta'!$A:$A,$B47,'00 Alimenta'!D:D)*-1)","v":0},{"$f":"IF('00 Aggregatore'!$D47=\"R\",SUMIF('00 Alimenta'!$A:$A,$B47,'00 Alimenta'!E:E),SUMIF('00 Alimenta'!$A:$A,$B47,'00 Alimenta'!E:E)*-1)","v":0}]
["AR","AA0580","Prestazioni di assistenza riabilitativa non soggette a compensazione extra Regione","R",{"$f":"IF('00 Aggregatore'!$D48=\"R\",SUMIF('00 Alimenta'!$A:$A,$B48,'00 Alimenta'!D:D),SUMIF('00 Alimenta'!$A:$A,$B48,'00 Alimenta'!D:D)*-1)","v":0},{"$f":"IF('00 Aggregatore'!$D48=\"R\",SUMIF('00 Alimenta'!$A:$A,$B48,'00 Alimenta'!E:E),SUMIF('00 Alimenta'!$A:$A,$B48,'00 Alimenta'!E:E)*-1)","v":0}]
["AR","AA0590","Altre prestazioni sanitarie e socio-sanitarie a rilevanza sanitaria non soggette a compensazione extra Regione","R",{"$f":"IF('00 Aggregatore'!$D49=\"R\",SUMIF('00 Alimenta'!$A:$A,$B49,'00 Alimenta'!D:D),SUMIF('00 Alimenta'!$A:$A,$B49,'00 Alimenta'!D:D)*-1)","v":1696.8},{"$f":"IF('00 Aggregatore'!$D49=\"R\",SUMIF('00 Alimenta'!$A:$A,$B49,'00 Alimenta'!E:E),SUMIF('00 Alimenta'!$A:$A,$B49,'00 Alimenta'!E:E)*-1)","v":2626.39}]
["AR","AA0600","Altre prestazioni sanitarie a rilevanza sanitaria - Mobilità attiva internazionale","R",{"$f":"IF('00 Aggregatore'!$D50=\"R\",SUMIF('00 Alimenta'!$A:$A,$B50,'00 Alimenta'!D:D),SUMIF('00 Alimenta'!$A:$A,$B50,'00 Alimenta'!D:D)*-1)","v":0},{"$f":"IF('00 Aggregatore'!$D50=\"R\",SUMIF('00 Alimenta'!$A:$A,$B50,'00 Alimenta'!E:E),SUMIF('00 Alimenta'!$A:$A,$B50,'00 Alimenta'!E:E)*-1)","v":318967.76}]
["AR","AA0620","Prestazioni di ricovero da privati extra Regione in compensazione (mobilità attiva)","R",{"$f":"IF('00 Aggregatore'!$D51=\"R\",SUMIF('00 Alimenta'!$A:$A,$B51,'00 Alimenta'!D:D),SUMIF('00 Alimenta'!$A:$A,$B51,'00 Alimenta'!D:D)*-1)","v":11917704.07},{"$f":"IF('00 Aggregatore'!$D51=\"R\",SUMIF('00 Alimenta'!$A:$A,$B51,'00 Alimenta'!E:E),SUMIF('00 Alimenta'!$A:$A,$B51,'00 Alimenta'!E:E)*-1)","v":10285883.1}]
["AR","AA0630","Prestazioni ambulatoriali da privati extra Regione in compensazione (mobilità attiva)","R",{"$f":"IF('00 Aggregatore'!$D52=\"R\",SUMIF('00 Alimenta'!$A:$A,$B52,'00 Alimenta'!D:D),SUMIF('00 Alimenta'!$A:$A,$B52,'00 Alimenta'!D:D)*-1)","v":218419.7},{"$f":"IF('00 Aggregatore'!$D52=\"R\",SUMIF('00 Alimenta'!$A:$A,$B52,'00 Alimenta'!E:E),SUMIF('00 Alimenta'!$A:$A,$B52,'00 Alimenta'!E:E)*-1)","v":201606.44}]
["AR","AA0640","Prestazioni di File F da privati extra Regione in compensazione (mobilità attiva)","R",{"$f":"IF('00 Aggregatore'!$D53=\"R\",SUMIF('00 Alimenta'!$A:$A,$B53,'00 Alimenta'!D:D),SUMIF('00 Alimenta'!$A:$A,$B53,'00 Alimenta'!D:D)*-1)","v":0},{"$f":"IF('00 Aggregatore'!$D53=\"R\",SUMIF('00 Alimenta'!$A:$A,$B53,'00 Alimenta'!E:E),SUMIF('00 Alimenta'!$A:$A,$B53,'00 Alimenta'!E:E)*-1)","v":0}]
["AR","AA0650","Altre prestazioni sanitarie e socio-sanitarie a rilevanza sanitaria erogate da privati v/residenti extra Regione in compensazione (mobilità attiva)","R",{"$f":"IF('00 Aggregatore'!$D54=\"R\",SUMIF('00 Alimenta'!$A:$A,$B54,'00 Alimenta'!D:D),SUMIF('00 Alimenta'!$A:$A,$B54,'00 Alimenta'!D:D)*-1)","v":0},{"$f":"IF('00 Aggregatore'!$D54=\"R\",SUMIF('00 Alimenta'!$A:$A,$B54,'00 Alimenta'!E:E),SUMIF('00 Alimenta'!$A:$A,$B54,'00 Alimenta'!E:E)*-1)","v":0}]
["AR","AA0660","Ricavi per prestazioni sanitarie e socio-sanitarie a rilevanza sanitaria erogate a privati","R",{"$f":"IF('00 Aggregatore'!$D55=\"R\",SUMIF('00 Alimenta'!$A:$A,$B55,'00 Alimenta'!D:D),SUMIF('00 Alimenta'!$A:$A,$B55,'00 Alimenta'!D:D)*-1)","v":3569406.3100000005},{"$f":"IF('00 Aggregatore'!$D55=\"R\",SUMIF('00 Alimenta'!$A:$A,$B55,'00 Alimenta'!E:E),SUMIF('00 Alimenta'!$A:$A,$B55,'00 Alimenta'!E:E)*-1)","v":3620504.31}]
["AR","AA0680","Ricavi per prestazioni sanitarie intramoenia - Area ospedaliera","R",{"$f":"IF('00 Aggregatore'!$D56=\"R\",SUMIF('00 Alimenta'!$A:$A,$B56,'00 Alimenta'!D:D),SUMIF('00 Alimenta'!$A:$A,$B56,'00 Alimenta'!D:D)*-1)","v":50045.82},{"$f":"IF('00 Aggregatore'!$D56=\"R\",SUMIF('00 Alimenta'!$A:$A,$B56,'00 Alimenta'!E:E),SUMIF('00 Alimenta'!$A:$A,$B56,'00 Alimenta'!E:E)*-1)","v":80436.56}]
["AR","AA0690","Ricavi per prestazioni sanitarie intramoenia - Area specialistica","R",{"$f":"IF('00 Aggregatore'!$D57=\"R\",SUMIF('00 Alimenta'!$A:$A,$B57,'00 Alimenta'!D:D),SUMIF('00 Alimenta'!$A:$A,$B57,'00 Alimenta'!D:D)*-1)","v":3252006},{"$f":"IF('00 Aggregatore'!$D57=\"R\",SUMIF('00 Alimenta'!$A:$A,$B57,'00 Alimenta'!E:E),SUMIF('00 Alimenta'!$A:$A,$B57,'00 Alimenta'!E:E)*-1)","v":3326104}]
["AR","AA0700","Ricavi per prestazioni sanitarie intramoenia - Area sanità pubblica","R",{"$f":"IF('00 Aggregatore'!$D58=\"R\",SUMIF('00 Alimenta'!$A:$A,$B58,'00 Alimenta'!D:D),SUMIF('00 Alimenta'!$A:$A,$B58,'00 Alimenta'!D:D)*-1)","v":22414.54},{"$f":"IF('00 Aggregatore'!$D58=\"R\",SUMIF('00 Alimenta'!$A:$A,$B58,'00 Alimenta'!E:E),SUMIF('00 Alimenta'!$A:$A,$B58,'00 Alimenta'!E:E)*-1)","v":17534.57}]
["AR","AA0710","Ricavi per prestazioni sanitarie intramoenia - Consulenze (ex art. 55 c.1 lett. c), d) ed ex art. 57-58)","R",{"$f":"IF('00 Aggregatore'!$D59=\"R\",SUMIF('00 Alimenta'!$A:$A,$B59,'00 Alimenta'!D:D),SUMIF('00 Alimenta'!$A:$A,$B59,'00 Alimenta'!D:D)*-1)","v":478823.7},{"$f":"IF('00 Aggregatore'!$D59=\"R\",SUMIF('00 Alimenta'!$A:$A,$B59,'00 Alimenta'!E:E),SUMIF('00 Alimenta'!$A:$A,$B59,'00 Alimenta'!E:E)*-1)","v":677848.85}]
["AR","AA0720","Ricavi per prestazioni sanitarie intramoenia - Consulenze (ex art. 55 c.1 lett. c), d) ed ex art. 57-58) (Aziende sanitarie pubbliche della Regione)","R",{"$f":"IF('00 Aggregatore'!$D60=\"R\",SUMIF('00 Alimenta'!$A:$A,$B60,'00 Alimenta'!D:D),SUMIF('00 Alimenta'!$A:$A,$B60,'00 Alimenta'!D:D)*-1)","v":0},{"$f":"IF('00 Aggregatore'!$D60=\"R\",SUMIF('00 Alimenta'!$A:$A,$B60,'00 Alimenta'!E:E),SUMIF('00 Alimenta'!$A:$A,$B60,'00 Alimenta'!E:E)*-1)","v":0}]
["AR","AA0730","Ricavi per prestazioni sanitarie intramoenia - Altro","R",{"$f":"IF('00 Aggregatore'!$D61=\"R\",SUMIF('00 Alimenta'!$A:$A,$B61,'00 Alimenta'!D:D),SUMIF('00 Alimenta'!$A:$A,$B61,'00 Alimenta'!D:D)*-1)","v":97870.17},{"$f":"IF('00 Aggregatore'!$D61=\"R\",SUMIF('00 Alimenta'!$A:$A,$B61,'00 Alimenta'!E:E),SUMIF('00 Alimenta'!$A:$A,$B61,'00 Alimenta'!E:E)*-1)","v":130775.39}]
["AR","AA0740","Ricavi per prestazioni sanitarie intramoenia - Altro (Aziende sanitarie pubbliche della Regione)","R",{"$f":"IF('00 Aggregatore'!$D62=\"R\",SUMIF('00 Alimenta'!$A:$A,$B62,'00 Alimenta'!D:D),SUMIF('00 Alimenta'!$A:$A,$B62,'00 Alimenta'!D:D)*-1)","v":18272.099999999999},{"$f":"IF('00 Aggregatore'!$D62=\"R\",SUMIF('00 Alimenta'!$A:$A,$B62,'00 Alimenta'!E:E),SUMIF('00 Alimenta'!$A:$A,$B62,'00 Alimenta'!E:E)*-1)","v":5779.7}]
["AR","AA0760","Rimborsi assicurativi","R",{"$f":"IF('00 Aggregatore'!$D63=\"R\",SUMIF('00 Alimenta'!$A:$A,$B63,'00 Alimenta'!D:D),SUMIF('00 Alimenta'!$A:$A,$B63,'00 Alimenta'!D:D)*-1)","v":166973.67000000001},{"$f":"IF('00 Aggregatore'!$D63=\"R\",SUMIF('00 Alimenta'!$A:$A,$B63,'00 Alimenta'!E:E),SUMIF('00 Alimenta'!$A:$A,$B63,'00 Alimenta'!E:E)*-1)","v":151672.57999999999}]
["AR","AA0780","Rimborso degli oneri stipendiali del personale dell'Azienda in posizione di comando presso la Regione","R",{"$f":"IF('00 Aggregatore'!$D64=\"R\",SUMIF('00 Alimenta'!$A:$A,$B64,'00 Alimenta'!D:D),SUMIF('00 Alimenta'!$A:$A,$B64,'00 Alimenta'!D:D)*-1)","v":0},{"$f":"IF('00 Aggregatore'!$D64=\"R\",SUMIF('00 Alimenta'!$A:$A,$B64,'00 Alimenta'!E:E),SUMIF('00 Alimenta'!$A:$A,$B64,'00 Alimenta'!E:E)*-1)","v":0}]
["AR","AA0790","Altri concorsi, recuperi e rimborsi da parte della Regione","R",{"$f":"IF('00 Aggregatore'!$D65=\"R\",SUMIF('00 Alimenta'!$A:$A,$B65,'00 Alimenta'!D:D),SUMIF('00 Alimenta'!$A:$A,$B65,'00 Alimenta'!D:D)*-1)","v":0},{"$f":"IF('00 Aggregatore'!$D65=\"R\",SUMIF('00 Alimenta'!$A:$A,$B65,'00 Alimenta'!E:E),SUMIF('00 Alimenta'!$A:$A,$B65,'00 Alimenta'!E:E)*-1)","v":0}]
["AR","AA0810","Rimborso degli oneri stipendiali del personale dipendente dell'Azienda in posizione di comando presso Aziende sanitarie pubbliche della Regione","R",{"$f":"IF('00 Aggregatore'!$D66=\"R\",SUMIF('00 Alimenta'!$A:$A,$B66,'00 Alimenta'!D:D),SUMIF('00 Alimenta'!$A:$A,$B66,'00 Alimenta'!D:D)*-1)","v":14346.46},{"$f":"IF('00 Aggregatore'!$D66=\"R\",SUMIF('00 Alimenta'!$A:$A,$B66,'00 Alimenta'!E:E),SUMIF('00 Alimenta'!$A:$A,$B66,'00 Alimenta'!E:E)*-1)","v":23253.72}]
["AR","AA0820","Rimborsi per acquisto beni da parte di Aziende sanitarie pubbliche della Regione","R",{"$f":"IF('00 Aggregatore'!$D67=\"R\",SUMIF('00 Alimenta'!$A:$A,$B67,'00 Alimenta'!D:D),SUMIF('00 Alimenta'!$A:$A,$B67,'00 Alimenta'!D:D)*-1)","v":0},{"$f":"IF('00 Aggregatore'!$D67=\"R\",SUMIF('00 Alimenta'!$A:$A,$B67,'00 Alimenta'!E:E),SUMIF('00 Alimenta'!$A:$A,$B67,'00 Alimenta'!E:E)*-1)","v":0}]
["AR","AA0830","Altri concorsi, recuperi e rimborsi da parte di Aziende sanitarie pubbliche della Regione","R",{"$f":"IF('00 Aggregatore'!$D68=\"R\",SUMIF('00 Alimenta'!$A:$A,$B68,'00 Alimenta'!D:D),SUMIF('00 Alimenta'!$A:$A,$B68,'00 Alimenta'!D:D)*-1)","v":135883.64000000001},{"$f":"IF('00 Aggregatore'!$D68=\"R\",SUMIF('00 Alimenta'!$A:$A,$B68,'00 Alimenta'!E:E),SUMIF('00 Alimenta'!$A:$A,$B68,'00 Alimenta'!E:E)*-1)","v":180596.98}]
["AR","AA0850","Rimborso degli oneri stipendiali del personale dipendente dell'Azienda in posizione di comando presso altri soggetti pubblici","R",{"$f":"IF('00 Aggregatore'!$D69=\"R\",SUMIF('00 Alimenta'!$A:$A,$B69,'00 Alimenta'!D:D),SUMIF('00 Alimenta'!$A:$A,$B69,'00 Alimenta'!D:D)*-1)","v":114750.81},{"$f":"IF('00 Aggregatore'!$D69=\"R\",SUMIF('00 Alimenta'!$A:$A,$B69,'00 Alimenta'!E:E),SUMIF('00 Alimenta'!$A:$A,$B69,'00 Alimenta'!E:E)*-1)","v":150326.43}]
[{"$f":"LEFT(B70,1)&D70","v":"AR"},"AA0860","Rimborsi per acquisto beni da parte di altri soggetti pubblici","R",{"$f":"IF('00 Aggregatore'!$D70=\"R\",SUMIF('00 Alimenta'!$A:$A,$B70,'00 Alimenta'!D:D),SUMIF('00 Alimenta'!$A:$A,$B70,'00 Alimenta'!D:D)*-1)","v":14709.64},{"$f":"IF('00 Aggregatore'!$D70=\"R\",SUMIF('00 Alimenta'!$A:$A,$B70,'00 Alimenta'!E:E),SUMIF('00 Alimenta'!$A:$A,$B70,'00 Alimenta'!E:E)*-1)","v":8374.7800000000007}]
["AR","AA0870","Altri concorsi, recuperi e rimborsi da parte di altri soggetti pubblici","R",{"$f":"IF('00 Aggregatore'!$D71=\"R\",SUMIF('00 Alimenta'!$A:$A,$B71,'00 Alimenta'!D:D),SUMIF('00 Alimenta'!$A:$A,$B71,'00 Alimenta'!D:D)*-1)","v":157670.22},{"$f":"IF('00 Aggregatore'!$D71=\"R\",SUMIF('00 Alimenta'!$A:$A,$B71,'00 Alimenta'!E:E),SUMIF('00 Alimenta'!$A:$A,$B71,'00 Alimenta'!E:E)*-1)","v":94410.650000000009}]
["AR","AA0900","Pay-back per il superamento del tetto della spesa farmaceutica territoriale","R",{"$f":"IF('00 Aggregatore'!$D72=\"R\",SUMIF('00 Alimenta'!$A:$A,$B72,'00 Alimenta'!D:D),SUMIF('00 Alimenta'!$A:$A,$B72,'00 Alimenta'!D:D)*-1)","v":0},{"$f":"IF('00 Aggregatore'!$D72=\"R\",SUMIF('00 Alimenta'!$A:$A,$B72,'00 Alimenta'!E:E),SUMIF('00 Alimenta'!$A:$A,$B72,'00 Alimenta'!E:E)*-1)","v":0}]
["AR","AA0910","Pay-back per superamento del tetto della spesa farmaceutica ospedaliera","R",{"$f":"IF('00 Aggregatore'!$D73=\"R\",SUMIF('00 Alimenta'!$A:$A,$B73,'00 Alimenta'!D:D),SUMIF('00 Alimenta'!$A:$A,$B73,'00 Alimenta'!D:D)*-1)","v":20},{"$f":"IF('00 Aggregatore'!$D73=\"R\",SUMIF('00 Alimenta'!$A:$A,$B73,'00 Alimenta'!E:E),SUMIF('00 Alimenta'!$A:$A,$B73,'00 Alimenta'!E:E)*-1)","v":0}]
["AR","AA0920","Ulteriore Pay-back","R",{"$f":"IF('00 Aggregatore'!$D74=\"R\",SUMIF('00 Alimenta'!$A:$A,$B74,'00 Alimenta'!D:D),SUMIF('00 Alimenta'!$A:$A,$B74,'00 Alimenta'!D:D)*-1)","v":3426932.4},{"$f":"IF('00 Aggregatore'!$D74=\"R\",SUMIF('00 Alimenta'!$A:$A,$B74,'00 Alimenta'!E:E),SUMIF('00 Alimenta'!$A:$A,$B74,'00 Alimenta'!E:E)*-1)","v":2615698.91}]
["AR","AA0930","Altri concorsi, recuperi e rimborsi da privati","R",{"$f":"IF('00 Aggregatore'!$D75=\"R\",SUMIF('00 Alimenta'!$A:$A,$B75,'00 Alimenta'!D:D),SUMIF('00 Alimenta'!$A:$A,$B75,'00 Alimenta'!D:D)*-1)","v":866980.31},{"$f":"IF('00 Aggregatore'!$D75=\"R\",SUMIF('00 Alimenta'!$A:$A,$B75,'00 Alimenta'!E:E),SUMIF('00 Alimenta'!$A:$A,$B75,'00 Alimenta'!E:E)*-1)","v":634408.52}]
["AR","AA0950","Compartecipazione alla spesa per prestazioni sanitarie - Ticket sulle prestazioni di specialistica ambulatoriale","R",{"$f":"IF('00 Aggregatore'!$D76=\"R\",SUMIF('00 Alimenta'!$A:$A,$B76,'00 Alimenta'!D:D),SUMIF('00 Alimenta'!$A:$A,$B76,'00 Alimenta'!D:D)*-1)","v":6414769.3200000003},{"$f":"IF('00 Aggregatore'!$D76=\"R\",SUMIF('00 Alimenta'!$A:$A,$B76,'00 Alimenta'!E:E),SUMIF('00 Alimenta'!$A:$A,$B76,'00 Alimenta'!E:E)*-1)","v":6543145.3100000005}]
["AR","AA0960","Compartecipazione alla spesa per prestazioni sanitarie - Ticket sul pronto soccorso","R",{"$f":"IF('00 Aggregatore'!$D77=\"R\",SUMIF('00 Alimenta'!$A:$A,$B77,'00 Alimenta'!D:D),SUMIF('00 Alimenta'!$A:$A,$B77,'00 Alimenta'!D:D)*-1)","v":330322.76},{"$f":"IF('00 Aggregatore'!$D77=\"R\",SUMIF('00 Alimenta'!$A:$A,$B77,'00 Alimenta'!E:E),SUMIF('00 Alimenta'!$A:$A,$B77,'00 Alimenta'!E:E)*-1)","v":386661.64}]
["AR","AA0970","Compartecipazione alla spesa per prestazioni sanitarie (Ticket) - Altro","R",{"$f":"IF('00 Aggregatore'!$D78=\"R\",SUMIF('00 Alimenta'!$A:$A,$B78,'00 Alimenta'!D:D),SUMIF('00 Alimenta'!$A:$A,$B78,'00 Alimenta'!D:D)*-1)","v":0},{"$f":"IF('00 Aggregatore'!$D78=\"R\",SUMIF('00 Alimenta'!$A:$A,$B78,'00 Alimenta'!E:E),SUMIF('00 Alimenta'!$A:$A,$B78,'00 Alimenta'!E:E)*-1)","v":0}]
["AR","AA0990","Quota imputata all'esercizio dei finanziamenti per investimenti dallo Stato","R",{"$f":"IF('00 Aggregatore'!$D79=\"R\",SUMIF('00 Alimenta'!$A:$A,$B79,'00 Alimenta'!D:D),SUMIF('00 Alimenta'!$A:$A,$B79,'00 Alimenta'!D:D)*-1)","v":48286.07},{"$f":"IF('00 Aggregatore'!$D79=\"R\",SUMIF('00 Alimenta'!$A:$A,$B79,'00 Alimenta'!E:E),SUMIF('00 Alimenta'!$A:$A,$B79,'00 Alimenta'!E:E)*-1)","v":54754.03}]
["AR","AA1000","Quota imputata all'esercizio dei finanziamenti per investimenti da Regione","R",{"$f":"IF('00 Aggregatore'!$D80=\"R\",SUMIF('00 Alimenta'!$A:$A,$B80,'00 Alimenta'!D:D),SUMIF('00 Alimenta'!$A:$A,$B80,'00 Alimenta'!D:D)*-1)","v":1468544.84},{"$f":"IF('00 Aggregatore'!$D80=\"R\",SUMIF('00 Alimenta'!$A:$A,$B80,'00 Alimenta'!E:E),SUMIF('00 Alimenta'!$A:$A,$B80,'00 Alimenta'!E:E)*-1)","v":1674245.68}]
["AR","AA1010","Quota imputata all'esercizio dei finanziamenti per beni di prima dotazione","R",{"$f":"IF('00 Aggregatore'!$D81=\"R\",SUMIF('00 Alimenta'!$A:$A,$B81,'00 Alimenta'!D:D),SUMIF('00 Alimenta'!$A:$A,$B81,'00 Alimenta'!D:D)*-1)","v":3577467.93},{"$f":"IF('00 Aggregatore'!$D81=\"R\",SUMIF('00 Alimenta'!$A:$A,$B81,'00 Alimenta'!E:E),SUMIF('00 Alimenta'!$A:$A,$B81,'00 Alimenta'!E:E)*-1)","v":3577467.93}]
["AR","AA1020","Quota imputata all'esercizio dei contributi in c/esercizio FSR destinati ad investimenti","R",{"$f":"IF('00 Aggregatore'!$D82=\"R\",SUMIF('00 Alimenta'!$A:$A,$B82,'00 Alimenta'!D:D),SUMIF('00 Alimenta'!$A:$A,$B82,'00 Alimenta'!D:D)*-1)","v":4730694.3099999996},{"$f":"IF('00 Aggregatore'!$D82=\"R\",SUMIF('00 Alimenta'!$A:$A,$B82,'00 Alimenta'!E:E),SUMIF('00 Alimenta'!$A:$A,$B82,'00 Alimenta'!E:E)*-1)","v":5185207.28}]
["AR","AA1030","Quota imputata all'esercizio degli altri contributi in c/esercizio destinati ad investimenti","R",{"$f":"IF('00 Aggregatore'!$D83=\"R\",SUMIF('00 Alimenta'!$A:$A,$B83,'00 Alimenta'!D:D),SUMIF('00 Alimenta'!$A:$A,$B83,'00 Alimenta'!D:D)*-1)","v":0},{"$f":"IF('00 Aggregatore'!$D83=\"R\",SUMIF('00 Alimenta'!$A:$A,$B83,'00 Alimenta'!E:E),SUMIF('00 Alimenta'!$A:$A,$B83,'00 Alimenta'!E:E)*-1)","v":0}]
["AR","AA1040","Quota imputata all'esercizio di altre poste del patrimonio netto","R",{"$f":"IF('00 Aggregatore'!$D84=\"R\",SUMIF('00 Alimenta'!$A:$A,$B84,'00 Alimenta'!D:D),SUMIF('00 Alimenta'!$A:$A,$B84,'00 Alimenta'!D:D)*-1)","v":0},{"$f":"IF('00 Aggregatore'!$D84=\"R\",SUMIF('00 Alimenta'!$A:$A,$B84,'00 Alimenta'!E:E),SUMIF('00 Alimenta'!$A:$A,$B84,'00 Alimenta'!E:E)*-1)","v":0}]
["AR","AA1050","Incrementi delle immobilizzazioni per lavori interni","R",{"$f":"IF('00 Aggregatore'!$D85=\"R\",SUMIF('00 Alimenta'!$A:$A,$B85,'00 Alimenta'!D:D),SUMIF('00 Alimenta'!$A:$A,$B85,'00 Alimenta'!D:D)*-1)","v":0},{"$f":"IF('00 Aggregatore'!$D85=\"R\",SUMIF('00 Alimenta'!$A:$A,$B85,'00 Alimenta'!E:E),SUMIF('00 Alimenta'!$A:$A,$B85,'00 Alimenta'!E:E)*-1)","v":0}]
["AR","AA1070","Ricavi per prestazioni non sanitarie","R",{"$f":"IF('00 Aggregatore'!$D86=\"R\",SUMIF('00 Alimenta'!$A:$A,$B86,'00 Alimenta'!D:D),SUMIF('00 Alimenta'!$A:$A,$B86,'00 Alimenta'!D:D)*-1)","v":3023.66},{"$f":"IF('00 Aggregatore'!$D86=\"R\",SUMIF('00 Alimenta'!$A:$A,$B86,'00 Alimenta'!E:E),SUMIF('00 Alimenta'!$A:$A,$B86,'00 Alimenta'!E:E)*-1)","v":1738.6}]
["AR","AA1080","Fitti attivi e altri proventi da attività immobiliari","R",{"$f":"IF('00 Aggregatore'!$D87=\"R\",SUMIF('00 Alimenta'!$A:$A,$B87,'00 Alimenta'!D:D),SUMIF('00 Alimenta'!$A:$A,$B87,'00 Alimenta'!D:D)*-1)","v":221560.64},{"$f":"IF('00 Aggregatore'!$D87=\"R\",SUMIF('00 Alimenta'!$A:$A,$B87,'00 Alimenta'!E:E),SUMIF('00 Alimenta'!$A:$A,$B87,'00 Alimenta'!E:E)*-1)","v":186882.15}]
["AR","AA1090","Altri proventi diversi","R",{"$f":"IF('00 Aggregatore'!$D88=\"R\",SUMIF('00 Alimenta'!$A:$A,$B88,'00 Alimenta'!D:D),SUMIF('00 Alimenta'!$A:$A,$B88,'00 Alimenta'!D:D)*-1)","v":397717.1},{"$f":"IF('00 Aggregatore'!$D88=\"R\",SUMIF('00 Alimenta'!$A:$A,$B88,'00 Alimenta'!E:E),SUMIF('00 Alimenta'!$A:$A,$B88,'00 Alimenta'!E:E)*-1)","v":362826.20999999996}]
["BC","BA0040","Medicinali con AIC, ad eccezione di vaccini ed emoderivati di produzione regionale","C",{"$f":"IF('00 Aggregatore'!$D89=\"R\",SUMIF('00 Alimenta'!$A:$A,$B89,'00 Alimenta'!D:D),SUMIF('00 Alimenta'!$A:$A,$B89,'00 Alimenta'!D:D)*-1)","v":69235809.470000014},{"$f":"IF('00 Aggregatore'!$D89=\"R\",SUMIF('00 Alimenta'!$A:$A,$B89,'00 Alimenta'!E:E),SUMIF('00 Alimenta'!$A:$A,$B89,'00 Alimenta'!E:E)*-1)","v":82536637.089999989}]
["BC","BA0050","Medicinali senza AIC","C",{"$f":"IF('00 Aggregatore'!$D90=\"R\",SUMIF('00 Alimenta'!$A:$A,$B90,'00 Alimenta'!D:D),SUMIF('00 Alimenta'!$A:$A,$B90,'00 Alimenta'!D:D)*-1)","v":722585.84},{"$f":"IF('00 Aggregatore'!$D90=\"R\",SUMIF('00 Alimenta'!$A:$A,$B90,'00 Alimenta'!E:E),SUMIF('00 Alimenta'!$A:$A,$B90,'00 Alimenta'!E:E)*-1)","v":752264.34}]
["BC","BA0060","Emoderivati di produzione regionale","C",{"$f":"IF('00 Aggregatore'!$D91=\"R\",SUMIF('00 Alimenta'!$A:$A,$B91,'00 Alimenta'!D:D),SUMIF('00 Alimenta'!$A:$A,$B91,'00 Alimenta'!D:D)*-1)","v":0},{"$f":"IF('00 Aggregatore'!$D91=\"R\",SUMIF('00 Alimenta'!$A:$A,$B91,'00 Alimenta'!E:E),SUMIF('00 Alimenta'!$A:$A,$B91,'00 Alimenta'!E:E)*-1)","v":0}]
["BC","BA0080","da pubblico (Aziende sanitarie pubbliche della Regione) - Mobilità intraregionale","C",{"$f":"IF('00 Aggregatore'!$D92=\"R\",SUMIF('00 Alimenta'!$A:$A,$B92,'00 Alimenta'!D:D),SUMIF('00 Alimenta'!$A:$A,$B92,'00 Alimenta'!D:D)*-1)","v":0},{"$f":"IF('00 Aggregatore'!$D92=\"R\",SUMIF('00 Alimenta'!$A:$A,$B92,'00 Alimenta'!E:E),SUMIF('00 Alimenta'!$A:$A,$B92,'00 Alimenta'!E:E)*-1)","v":0}]
["BC","BA0090","da pubblico (Aziende sanitarie pubbliche extra Regione) - Mobilità extraregionale","C",{"$f":"IF('00 Aggregatore'!$D93=\"R\",SUMIF('00 Alimenta'!$A:$A,$B93,'00 Alimenta'!D:D),SUMIF('00 Alimenta'!$A:$A,$B93,'00 Alimenta'!D:D)*-1)","v":187348.99},{"$f":"IF('00 Aggregatore'!$D93=\"R\",SUMIF('00 Alimenta'!$A:$A,$B93,'00 Alimenta'!E:E),SUMIF('00 Alimenta'!$A:$A,$B93,'00 Alimenta'!E:E)*-1)","v":23080.75}]
["BC","BA0100","da altri soggetti","C",{"$f":"IF('00 Aggregatore'!$D94=\"R\",SUMIF('00 Alimenta'!$A:$A,$B94,'00 Alimenta'!D:D),SUMIF('00 Alimenta'!$A:$A,$B94,'00 Alimenta'!D:D)*-1)","v":0},{"$f":"IF('00 Aggregatore'!$D94=\"R\",SUMIF('00 Alimenta'!$A:$A,$B94,'00 Alimenta'!E:E),SUMIF('00 Alimenta'!$A:$A,$B94,'00 Alimenta'!E:E)*-1)","v":0}]
["BC","BA0220","Dispositivi medici","C",{"$f":"IF('00 Aggregatore'!$D95=\"R\",SUMIF('00 Alimenta'!$A:$A,$B95,'00 Alimenta'!D:D),SUMIF('00 Alimenta'!$A:$A,$B95,'00 Alimenta'!D:D)*-1)","v":25764695.790000003},{"$f":"IF('00 Aggregatore'!$D95=\"R\",SUMIF('00 Alimenta'!$A:$A,$B95,'00 Alimenta'!E:E),SUMIF('00 Alimenta'!$A:$A,$B95,'00 Alimenta'!E:E)*-1)","v":27013313.950000003}]
["BC","BA0230","Dispositivi medici impiantabili attivi","C",{"$f":"IF('00 Aggregatore'!$D96=\"R\",SUMIF('00 Alimenta'!$A:$A,$B96,'00 Alimenta'!D:D),SUMIF('00 Alimenta'!$A:$A,$B96,'00 Alimenta'!D:D)*-1)","v":3456008.28},{"$f":"IF('00 Aggregatore'!$D96=\"R\",SUMIF('00 Alimenta'!$A:$A,$B96,'00 Alimenta'!E:E),SUMIF('00 Alimenta'!$A:$A,$B96,'00 Alimenta'!E:E)*-1)","v":3071999.01}]
["BC","BA0240","Dispositivi medico diagnostici in vitro (IVD)","C",{"$f":"IF('00 Aggregatore'!$D97=\"R\",SUMIF('00 Alimenta'!$A:$A,$B97,'00 Alimenta'!D:D),SUMIF('00 Alimenta'!$A:$A,$B97,'00 Alimenta'!D:D)*-1)","v":11969007.5},{"$f":"IF('00 Aggregatore'!$D97=\"R\",SUMIF('00 Alimenta'!$A:$A,$B97,'00 Alimenta'!E:E),SUMIF('00 Alimenta'!$A:$A,$B97,'00 Alimenta'!E:E)*-1)","v":12786548.720000001}]
["BC","BA0250","Prodotti dietetici","C",{"$f":"IF('00 Aggregatore'!$D98=\"R\",SUMIF('00 Alimenta'!$A:$A,$B98,'00 Alimenta'!D:D),SUMIF('00 Alimenta'!$A:$A,$B98,'00 Alimenta'!D:D)*-1)","v":469645.74000000005},{"$f":"IF('00 Aggregatore'!$D98=\"R\",SUMIF('00 Alimenta'!$A:$A,$B98,'00 Alimenta'!E:E),SUMIF('00 Alimenta'!$A:$A,$B98,'00 Alimenta'!E:E)*-1)","v":468960.66}]
["BC","BA0260","Materiali per la profilassi (vaccini)","C",{"$f":"IF('00 Aggregatore'!$D99=\"R\",SUMIF('00 Alimenta'!$A:$A,$B99,'00 Alimenta'!D:D),SUMIF('00 Alimenta'!$A:$A,$B99,'00 Alimenta'!D:D)*-1)","v":2380862.56},{"$f":"IF('00 Aggregatore'!$D99=\"R\",SUMIF('00 Alimenta'!$A:$A,$B99,'00 Alimenta'!E:E),SUMIF('00 Alimenta'!$A:$A,$B99,'00 Alimenta'!E:E)*-1)","v":2222785.11}]
["BC","BA0270","Prodotti chimici","C",{"$f":"IF('00 Aggregatore'!$D100=\"R\",SUMIF('00 Alimenta'!$A:$A,$B100,'00 Alimenta'!D:D),SUMIF('00 Alimenta'!$A:$A,$B100,'00 Alimenta'!D:D)*-1)","v":0},{"$f":"IF('00 Aggregatore'!$D100=\"R\",SUMIF('00 Alimenta'!$A:$A,$B100,'00 Alimenta'!E:E),SUMIF('00 Alimenta'!$A:$A,$B100,'00 Alimenta'!E:E)*-1)","v":0}]
["BC","BA0280","Materiali e prodotti per uso veterinario","C",{"$f":"IF('00 Aggregatore'!$D101=\"R\",SUMIF('00 Alimenta'!$A:$A,$B101,'00 Alimenta'!D:D),SUMIF('00 Alimenta'!$A:$A,$B101,'00 Alimenta'!D:D)*-1)","v":7852.7999999999993},{"$f":"IF('00 Aggregatore'!$D101=\"R\",SUMIF('00 Alimenta'!$A:$A,$B101,'00 Alimenta'!E:E),SUMIF('00 Alimenta'!$A:$A,$B101,'00 Alimenta'!E:E)*-1)","v":20636.41}]
["BC","BA0290","Altri beni e prodotti sanitari","C",{"$f":"IF('00 Aggregatore'!$D102=\"R\",SUMIF('00 Alimenta'!$A:$A,$B102,'00 Alimenta'!D:D),SUMIF('00 Alimenta'!$A:$A,$B102,'00 Alimenta'!D:D)*-1)","v":1934574.6},{"$f":"IF('00 Aggregatore'!$D102=\"R\",SUMIF('00 Alimenta'!$A:$A,$B102,'00 Alimenta'!E:E),SUMIF('00 Alimenta'!$A:$A,$B102,'00 Alimenta'!E:E)*-1)","v":2193506.59}]
["BC","BA0300","Beni e prodotti sanitari da Aziende sanitarie pubbliche della Regione","C",{"$f":"IF('00 Aggregatore'!$D103=\"R\",SUMIF('00 Alimenta'!$A:$A,$B103,'00 Alimenta'!D:D),SUMIF('00 Alimenta'!$A:$A,$B103,'00 Alimenta'!D:D)*-1)","v":0},{"$f":"IF('00 Aggregatore'!$D103=\"R\",SUMIF('00 Alimenta'!$A:$A,$B103,'00 Alimenta'!E:E),SUMIF('00 Alimenta'!$A:$A,$B103,'00 Alimenta'!E:E)*-1)","v":0}]
["BC","BA0320","Prodotti alimentari","C",{"$f":"IF('00 Aggregatore'!$D104=\"R\",SUMIF('00 Alimenta'!$A:$A,$B104,'00 Alimenta'!D:D),SUMIF('00 Alimenta'!$A:$A,$B104,'00 Alimenta'!D:D)*-1)","v":250.58},{"$f":"IF('00 Aggregatore'!$D104=\"R\",SUMIF('00 Alimenta'!$A:$A,$B104,'00 Alimenta'!E:E),SUMIF('00 Alimenta'!$A:$A,$B104,'00 Alimenta'!E:E)*-1)","v":83.52}]
["BC","BA0330","Materiali di guardaroba, di pulizia e di convivenza in genere","C",{"$f":"IF('00 Aggregatore'!$D105=\"R\",SUMIF('00 Alimenta'!$A:$A,$B105,'00 Alimenta'!D:D),SUMIF('00 Alimenta'!$A:$A,$B105,'00 Alimenta'!D:D)*-1)","v":41796.379999999997},{"$f":"IF('00 Aggregatore'!$D105=\"R\",SUMIF('00 Alimenta'!$A:$A,$B105,'00 Alimenta'!E:E),SUMIF('00 Alimenta'!$A:$A,$B105,'00 Alimenta'!E:E)*-1)","v":64306.42}]
["BC","BA0340","Combustibili, carburanti e lubrificanti","C",{"$f":"IF('00 Aggregatore'!$D106=\"R\",SUMIF('00 Alimenta'!$A:$A,$B106,'00 Alimenta'!D:D),SUMIF('00 Alimenta'!$A:$A,$B106,'00 Alimenta'!D:D)*-1)","v":135937.70000000001},{"$f":"IF('00 Aggregatore'!$D106=\"R\",SUMIF('00 Alimenta'!$A:$A,$B106,'00 Alimenta'!E:E),SUMIF('00 Alimenta'!$A:$A,$B106,'00 Alimenta'!E:E)*-1)","v":172419.52}]
["BC","BA0350","Supporti informatici e cancelleria","C",{"$f":"IF('00 Aggregatore'!$D107=\"R\",SUMIF('00 Alimenta'!$A:$A,$B107,'00 Alimenta'!D:D),SUMIF('00 Alimenta'!$A:$A,$B107,'00 Alimenta'!D:D)*-1)","v":513727.87},{"$f":"IF('00 Aggregatore'!$D107=\"R\",SUMIF('00 Alimenta'!$A:$A,$B107,'00 Alimenta'!E:E),SUMIF('00 Alimenta'!$A:$A,$B107,'00 Alimenta'!E:E)*-1)","v":477974.89999999997}]
["BC","BA0360","Materiale per la manutenzione","C",{"$f":"IF('00 Aggregatore'!$D108=\"R\",SUMIF('00 Alimenta'!$A:$A,$B108,'00 Alimenta'!D:D),SUMIF('00 Alimenta'!$A:$A,$B108,'00 Alimenta'!D:D)*-1)","v":207783.52999999997},{"$f":"IF('00 Aggregatore'!$D108=\"R\",SUMIF('00 Alimenta'!$A:$A,$B108,'00 Alimenta'!E:E),SUMIF('00 Alimenta'!$A:$A,$B108,'00 Alimenta'!E:E)*-1)","v":239884.37}]
["BC","BA0370","Altri beni e prodotti non sanitari","C",{"$f":"IF('00 Aggregatore'!$D109=\"R\",SUMIF('00 Alimenta'!$A:$A,$B109,'00 Alimenta'!D:D),SUMIF('00 Alimenta'!$A:$A,$B109,'00 Alimenta'!D:D)*-1)","v":48626.559999999998},{"$f":"IF('00 Aggregatore'!$D109=\"R\",SUMIF('00 Alimenta'!$A:$A,$B109,'00 Alimenta'!E:E),SUMIF('00 Alimenta'!$A:$A,$B109,'00 Alimenta'!E:E)*-1)","v":45073.96}]
["BC","BA0380","Beni e prodotti non sanitari da Aziende sanitarie pubbliche della Regione","C",{"$f":"IF('00 Aggregatore'!$D110=\"R\",SUMIF('00 Alimenta'!$A:$A,$B110,'00 Alimenta'!D:D),SUMIF('00 Alimenta'!$A:$A,$B110,'00 Alimenta'!D:D)*-1)","v":0},{"$f":"IF('00 Aggregatore'!$D110=\"R\",SUMIF('00 Alimenta'!$A:$A,$B110,'00 Alimenta'!E:E),SUMIF('00 Alimenta'!$A:$A,$B110,'00 Alimenta'!E:E)*-1)","v":0}]
["BC","BA0430","Costi per assistenza MMG","C",{"$f":"IF('00 Aggregatore'!$D111=\"R\",SUMIF('00 Alimenta'!$A:$A,$B111,'00 Alimenta'!D:D),SUMIF('00 Alimenta'!$A:$A,$B111,'00 Alimenta'!D:D)*-1)","v":24328709.329999998},{"$f":"IF('00 Aggregatore'!$D111=\"R\",SUMIF('00 Alimenta'!$A:$A,$B111,'00 Alimenta'!E:E),SUMIF('00 Alimenta'!$A:$A,$B111,'00 Alimenta'!E:E)*-1)","v":24517314.75}]
["BC","BA0440","Costi per assistenza PLS","C",{"$f":"IF('00 Aggregatore'!$D112=\"R\",SUMIF('00 Alimenta'!$A:$A,$B112,'00 Alimenta'!D:D),SUMIF('00 Alimenta'!$A:$A,$B112,'00 Alimenta'!D:D)*-1)","v":6208374.4000000004},{"$f":"IF('00 Aggregatore'!$D112=\"R\",SUMIF('00 Alimenta'!$A:$A,$B112,'00 Alimenta'!E:E),SUMIF('00 Alimenta'!$A:$A,$B112,'00 Alimenta'!E:E)*-1)","v":6415070.5300000003}]
["BC","BA0450","Costi per assistenza Continuità assistenziale","C",{"$f":"IF('00 Aggregatore'!$D113=\"R\",SUMIF('00 Alimenta'!$A:$A,$B113,'00 Alimenta'!D:D),SUMIF('00 Alimenta'!$A:$A,$B113,'00 Alimenta'!D:D)*-1)","v":4008916.53},{"$f":"IF('00 Aggregatore'!$D113=\"R\",SUMIF('00 Alimenta'!$A:$A,$B113,'00 Alimenta'!E:E),SUMIF('00 Alimenta'!$A:$A,$B113,'00 Alimenta'!E:E)*-1)","v":3931463.93}]
["BC","BA0460","Altro (medicina dei servizi, psicologi, medici 118, ecc.)","C",{"$f":"IF('00 Aggregatore'!$D114=\"R\",SUMIF('00 Alimenta'!$A:$A,$B114,'00 Alimenta'!D:D),SUMIF('00 Alimenta'!$A:$A,$B114,'00 Alimenta'!D:D)*-1)","v":889849.09},{"$f":"IF('00 Aggregatore'!$D114=\"R\",SUMIF('00 Alimenta'!$A:$A,$B114,'00 Alimenta'!E:E),SUMIF('00 Alimenta'!$A:$A,$B114,'00 Alimenta'!E:E)*-1)","v":789656.11}]
["BC","BA0470","da pubblico (Aziende sanitarie pubbliche della Regione) - Mobilità intraregionale","C",{"$f":"IF('00 Aggregatore'!$D115=\"R\",SUMIF('00 Alimenta'!$A:$A,$B115,'00 Alimenta'!D:D),SUMIF('00 Alimenta'!$A:$A,$B115,'00 Alimenta'!D:D)*-1)","v":35057.19},{"$f":"IF('00 Aggregatore'!$D115=\"R\",SUMIF('00 Alimenta'!$A:$A,$B115,'00 Alimenta'!E:E),SUMIF('00 Alimenta'!$A:$A,$B115,'00 Alimenta'!E:E)*-1)","v":38671}]
["BC","BA0480","da pubblico (Aziende sanitarie pubbliche extra Regione) - Mobilità extraregionale","C",{"$f":"IF('00 Aggregatore'!$D116=\"R\",SUMIF('00 Alimenta'!$A:$A,$B116,'00 Alimenta'!D:D),SUMIF('00 Alimenta'!$A:$A,$B116,'00 Alimenta'!D:D)*-1)","v":184748.58},{"$f":"IF('00 Aggregatore'!$D116=\"R\",SUMIF('00 Alimenta'!$A:$A,$B116,'00 Alimenta'!E:E),SUMIF('00 Alimenta'!$A:$A,$B116,'00 Alimenta'!E:E)*-1)","v":217107.5}]
["BC","BA0500","da convenzione","C",{"$f":"IF('00 Aggregatore'!$D117=\"R\",SUMIF('00 Alimenta'!$A:$A,$B117,'00 Alimenta'!D:D),SUMIF('00 Alimenta'!$A:$A,$B117,'00 Alimenta'!D:D)*-1)","v":52924145.520000003},{"$f":"IF('00 Aggregatore'!$D117=\"R\",SUMIF('00 Alimenta'!$A:$A,$B117,'00 Alimenta'!E:E),SUMIF('00 Alimenta'!$A:$A,$B117,'00 Alimenta'!E:E)*-1)","v":50129678.229999997}]
["BC","BA0510","da pubblico (Aziende sanitarie pubbliche della Regione) - Mobilità intraregionale","C",{"$f":"IF('00 Aggregatore'!$D118=\"R\",SUMIF('00 Alimenta'!$A:$A,$B118,'00 Alimenta'!D:D),SUMIF('00 Alimenta'!$A:$A,$B118,'00 Alimenta'!D:D)*-1)","v":1251970.51},{"$f":"IF('00 Aggregatore'!$D118=\"R\",SUMIF('00 Alimenta'!$A:$A,$B118,'00 Alimenta'!E:E),SUMIF('00 Alimenta'!$A:$A,$B118,'00 Alimenta'!E:E)*-1)","v":1277628.07}]
["BC","BA0520","da pubblico (extra Regione)","C",{"$f":"IF('00 Aggregatore'!$D119=\"R\",SUMIF('00 Alimenta'!$A:$A,$B119,'00 Alimenta'!D:D),SUMIF('00 Alimenta'!$A:$A,$B119,'00 Alimenta'!D:D)*-1)","v":387832.02},{"$f":"IF('00 Aggregatore'!$D119=\"R\",SUMIF('00 Alimenta'!$A:$A,$B119,'00 Alimenta'!E:E),SUMIF('00 Alimenta'!$A:$A,$B119,'00 Alimenta'!E:E)*-1)","v":457054.73}]
["BC","BA0540","da pubblico (Aziende sanitarie pubbliche della Regione)","C",{"$f":"IF('00 Aggregatore'!$D120=\"R\",SUMIF('00 Alimenta'!$A:$A,$B120,'00 Alimenta'!D:D),SUMIF('00 Alimenta'!$A:$A,$B120,'00 Alimenta'!D:D)*-1)","v":8998122.1099999994},{"$f":"IF('00 Aggregatore'!$D120=\"R\",SUMIF('00 Alimenta'!$A:$A,$B120,'00 Alimenta'!E:E),SUMIF('00 Alimenta'!$A:$A,$B120,'00 Alimenta'!E:E)*-1)","v":8879359.5700000003}]
["BC","BA0550","da pubblico (altri soggetti pubblici della Regione)","C",{"$f":"IF('00 Aggregatore'!$D121=\"R\",SUMIF('00 Alimenta'!$A:$A,$B121,'00 Alimenta'!D:D),SUMIF('00 Alimenta'!$A:$A,$B121,'00 Alimenta'!D:D)*-1)","v":189344.67},{"$f":"IF('00 Aggregatore'!$D121=\"R\",SUMIF('00 Alimenta'!$A:$A,$B121,'00 Alimenta'!E:E),SUMIF('00 Alimenta'!$A:$A,$B121,'00 Alimenta'!E:E)*-1)","v":360209.89}]
["BC","BA0560","da pubblico (extra Regione)","C",{"$f":"IF('00 Aggregatore'!$D122=\"R\",SUMIF('00 Alimenta'!$A:$A,$B122,'00 Alimenta'!D:D),SUMIF('00 Alimenta'!$A:$A,$B122,'00 Alimenta'!D:D)*-1)","v":4460024.9400000004},{"$f":"IF('00 Aggregatore'!$D122=\"R\",SUMIF('00 Alimenta'!$A:$A,$B122,'00 Alimenta'!E:E),SUMIF('00 Alimenta'!$A:$A,$B122,'00 Alimenta'!E:E)*-1)","v":4000753.58}]
["BC","BA0570","da privato - Medici SUMAI","C",{"$f":"IF('00 Aggregatore'!$D123=\"R\",SUMIF('00 Alimenta'!$A:$A,$B123,'00 Alimenta'!D:D),SUMIF('00 Alimenta'!$A:$A,$B123,'00 Alimenta'!D:D)*-1)","v":4899151.05},{"$f":"IF('00 Aggregatore'!$D123=\"R\",SUMIF('00 Alimenta'!$A:$A,$B123,'00 Alimenta'!E:E),SUMIF('00 Alimenta'!$A:$A,$B123,'00 Alimenta'!E:E)*-1)","v":4486744.21}]
["BC","BA0590","Servizi sanitari per assistenza specialistica da IRCCS privati e Policlinici privati","C",{"$f":"IF('00 Aggregatore'!$D124=\"R\",SUMIF('00 Alimenta'!$A:$A,$B124,'00 Alimenta'!D:D),SUMIF('00 Alimenta'!$A:$A,$B124,'00 Alimenta'!D:D)*-1)","v":60978.73},{"$f":"IF('00 Aggregatore'!$D124=\"R\",SUMIF('00 Alimenta'!$A:$A,$B124,'00 Alimenta'!E:E),SUMIF('00 Alimenta'!$A:$A,$B124,'00 Alimenta'!E:E)*-1)","v":83336.34}]
["BC","BA0600","Servizi sanitari per assistenza specialistica da Ospedali Classificati privati","C",{"$f":"IF('00 Aggregatore'!$D125=\"R\",SUMIF('00 Alimenta'!$A:$A,$B125,'00 Alimenta'!D:D),SUMIF('00 Alimenta'!$A:$A,$B125,'00 Alimenta'!D:D)*-1)","v":0},{"$f":"IF('00 Aggregatore'!$D125=\"R\",SUMIF('00 Alimenta'!$A:$A,$B125,'00 Alimenta'!E:E),SUMIF('00 Alimenta'!$A:$A,$B125,'00 Alimenta'!E:E)*-1)","v":0}]
["BC","BA0610","Servizi sanitari per assistenza specialistica da Case di Cura private","C",{"$f":"IF('00 Aggregatore'!$D126=\"R\",SUMIF('00 Alimenta'!$A:$A,$B126,'00 Alimenta'!D:D),SUMIF('00 Alimenta'!$A:$A,$B126,'00 Alimenta'!D:D)*-1)","v":5412858.8699999992},{"$f":"IF('00 Aggregatore'!$D126=\"R\",SUMIF('00 Alimenta'!$A:$A,$B126,'00 Alimenta'!E:E),SUMIF('00 Alimenta'!$A:$A,$B126,'00 Alimenta'!E:E)*-1)","v":5463686.8200000003}]
["BC","BA0620","Servizi sanitari per assistenza specialistica da altri privati","C",{"$f":"IF('00 Aggregatore'!$D127=\"R\",SUMIF('00 Alimenta'!$A:$A,$B127,'00 Alimenta'!D:D),SUMIF('00 Alimenta'!$A:$A,$B127,'00 Alimenta'!D:D)*-1)","v":3284005.5},{"$f":"IF('00 Aggregatore'!$D127=\"R\",SUMIF('00 Alimenta'!$A:$A,$B127,'00 Alimenta'!E:E),SUMIF('00 Alimenta'!$A:$A,$B127,'00 Alimenta'!E:E)*-1)","v":3338782.85}]
["BC","BA0630","da privato per cittadini non residenti - extra Regione (Mobilità attiva in compensazione)","C",{"$f":"IF('00 Aggregatore'!$D128=\"R\",SUMIF('00 Alimenta'!$A:$A,$B128,'00 Alimenta'!D:D),SUMIF('00 Alimenta'!$A:$A,$B128,'00 Alimenta'!D:D)*-1)","v":214698.2},{"$f":"IF('00 Aggregatore'!$D128=\"R\",SUMIF('00 Alimenta'!$A:$A,$B128,'00 Alimenta'!E:E),SUMIF('00 Alimenta'!$A:$A,$B128,'00 Alimenta'!E:E)*-1)","v":196698.22999999998}]
["BC","BA0650","da pubblico (Aziende sanitarie pubbliche della Regione)","C",{"$f":"IF('00 Aggregatore'!$D129=\"R\",SUMIF('00 Alimenta'!$A:$A,$B129,'00 Alimenta'!D:D),SUMIF('00 Alimenta'!$A:$A,$B129,'00 Alimenta'!D:D)*-1)","v":4855060.17},{"$f":"IF('00 Aggregatore'!$D129=\"R\",SUMIF('00 Alimenta'!$A:$A,$B129,'00 Alimenta'!E:E),SUMIF('00 Alimenta'!$A:$A,$B129,'00 Alimenta'!E:E)*-1)","v":4832965.95}]
["BC","BA0660","da pubblico (altri soggetti pubblici della Regione)","C",{"$f":"IF('00 Aggregatore'!$D130=\"R\",SUMIF('00 Alimenta'!$A:$A,$B130,'00 Alimenta'!D:D),SUMIF('00 Alimenta'!$A:$A,$B130,'00 Alimenta'!D:D)*-1)","v":0},{"$f":"IF('00 Aggregatore'!$D130=\"R\",SUMIF('00 Alimenta'!$A:$A,$B130,'00 Alimenta'!E:E),SUMIF('00 Alimenta'!$A:$A,$B130,'00 Alimenta'!E:E)*-1)","v":0}]
["BC","BA0670","da pubblico (extra Regione) non soggetti a compensazione","C",{"$f":"IF('00 Aggregatore'!$D131=\"R\",SUMIF('00 Alimenta'!$A:$A,$B131,'00 Alimenta'!D:D),SUMIF('00 Alimenta'!$A:$A,$B131,'00 Alimenta'!D:D)*-1)","v":0},{"$f":"IF('00 Aggregatore'!$D131=\"R\",SUMIF('00 Alimenta'!$A:$A,$B131,'00 Alimenta'!E:E),SUMIF('00 Alimenta'!$A:$A,$B131,'00 Alimenta'!E:E)*-1)","v":0}]
["BC","BA0680","da privato (intraregionale)","C",{"$f":"IF('00 Aggregatore'!$D132=\"R\",SUMIF('00 Alimenta'!$A:$A,$B132,'00 Alimenta'!D:D),SUMIF('00 Alimenta'!$A:$A,$B132,'00 Alimenta'!D:D)*-1)","v":14460769.459999999},{"$f":"IF('00 Aggregatore'!$D132=\"R\",SUMIF('00 Alimenta'!$A:$A,$B132,'00 Alimenta'!E:E),SUMIF('00 Alimenta'!$A:$A,$B132,'00 Alimenta'!E:E)*-1)","v":14612451.73}]
["BC","BA0690","da privato (extraregionale)","C",{"$f":"IF('00 Aggregatore'!$D133=\"R\",SUMIF('00 Alimenta'!$A:$A,$B133,'00 Alimenta'!D:D),SUMIF('00 Alimenta'!$A:$A,$B133,'00 Alimenta'!D:D)*-1)","v":591378.35},{"$f":"IF('00 Aggregatore'!$D133=\"R\",SUMIF('00 Alimenta'!$A:$A,$B133,'00 Alimenta'!E:E),SUMIF('00 Alimenta'!$A:$A,$B133,'00 Alimenta'!E:E)*-1)","v":545484.88}]
[{"$f":"LEFT(B134,1)&D134","v":"BC"},"BA0710","da pubblico (Aziende sanitarie pubbliche della Regione)","C",{"$f":"IF('00 Aggregatore'!$D134=\"R\",SUMIF('00 Alimenta'!$A:$A,$B134,'00 Alimenta'!D:D),SUMIF('00 Alimenta'!$A:$A,$B134,'00 Alimenta'!D:D)*-1)","v":0},{"$f":"IF('00 Aggregatore'!$D134=\"R\",SUMIF('00 Alimenta'!$A:$A,$B134,'00 Alimenta'!E:E),SUMIF('00 Alimenta'!$A:$A,$B134,'00 Alimenta'!E:E)*-1)","v":0}]
["BC","BA0720","da pubblico (altri soggetti pubblici della Regione)","C",{"$f":"IF('00 Aggregatore'!$D135=\"R\",SUMIF('00 Alimenta'!$A:$A,$B135,'00 Alimenta'!D:D),SUMIF('00 Alimenta'!$A:$A,$B135,'00 Alimenta'!D:D)*-1)","v":0},{"$f":"IF('00 Aggregatore'!$D135=\"R\",SUMIF('00 Alimenta'!$A:$A,$B135,'00 Alimenta'!E:E),SUMIF('00 Alimenta'!$A:$A,$B135,'00 Alimenta'!E:E)*-1)","v":0}]
["BC","BA0730","da pubblico (extra Regione)","C",{"$f":"IF('00 Aggregatore'!$D136=\"R\",SUMIF('00 Alimenta'!$A:$A,$B136,'00 Alimenta'!D:D),SUMIF('00 Alimenta'!$A:$A,$B136,'00 Alimenta'!D:D)*-1)","v":0},{"$f":"IF('00 Aggregatore'!$D136=\"R\",SUMIF('00 Alimenta'!$A:$A,$B136,'00 Alimenta'!E:E),SUMIF('00 Alimenta'!$A:$A,$B136,'00 Alimenta'!E:E)*-1)","v":0}]
["BC","BA0740","da privato","C",{"$f":"IF('00 Aggregatore'!$D137=\"R\",SUMIF('00 Alimenta'!$A:$A,$B137,'00 Alimenta'!D:D),SUMIF('00 Alimenta'!$A:$A,$B137,'00 Alimenta'!D:D)*-1)","v":1813040.82},{"$f":"IF('00 Aggregatore'!$D137=\"R\",SUMIF('00 Alimenta'!$A:$A,$B137,'00 Alimenta'!E:E),SUMIF('00 Alimenta'!$A:$A,$B137,'00 Alimenta'!E:E)*-1)","v":1802068.84}]
["BC","BA0760","da pubblico (Aziende sanitarie pubbliche della Regione)","C",{"$f":"IF('00 Aggregatore'!$D138=\"R\",SUMIF('00 Alimenta'!$A:$A,$B138,'00 Alimenta'!D:D),SUMIF('00 Alimenta'!$A:$A,$B138,'00 Alimenta'!D:D)*-1)","v":0},{"$f":"IF('00 Aggregatore'!$D138=\"R\",SUMIF('00 Alimenta'!$A:$A,$B138,'00 Alimenta'!E:E),SUMIF('00 Alimenta'!$A:$A,$B138,'00 Alimenta'!E:E)*-1)","v":0}]
["BC","BA0770","da pubblico (altri soggetti pubblici della Regione)","C",{"$f":"IF('00 Aggregatore'!$D139=\"R\",SUMIF('00 Alimenta'!$A:$A,$B139,'00 Alimenta'!D:D),SUMIF('00 Alimenta'!$A:$A,$B139,'00 Alimenta'!D:D)*-1)","v":0},{"$f":"IF('00 Aggregatore'!$D139=\"R\",SUMIF('00 Alimenta'!$A:$A,$B139,'00 Alimenta'!E:E),SUMIF('00 Alimenta'!$A:$A,$B139,'00 Alimenta'!E:E)*-1)","v":0}]
["BC","BA0780","da pubblico (extra Regione)","C",{"$f":"IF('00 Aggregatore'!$D140=\"R\",SUMIF('00 Alimenta'!$A:$A,$B140,'00 Alimenta'!D:D),SUMIF('00 Alimenta'!$A:$A,$B140,'00 Alimenta'!D:D)*-1)","v":0},{"$f":"IF('00 Aggregatore'!$D140=\"R\",SUMIF('00 Alimenta'!$A:$A,$B140,'00 Alimenta'!E:E),SUMIF('00 Alimenta'!$A:$A,$B140,'00 Alimenta'!E:E)*-1)","v":0}]
["BC","BA0790","da privato","C",{"$f":"IF('00 Aggregatore'!$D141=\"R\",SUMIF('00 Alimenta'!$A:$A,$B141,'00 Alimenta'!D:D),SUMIF('00 Alimenta'!$A:$A,$B141,'00 Alimenta'!D:D)*-1)","v":6384295.54},{"$f":"IF('00 Aggregatore'!$D141=\"R\",SUMIF('00 Alimenta'!$A:$A,$B141,'00 Alimenta'!E:E),SUMIF('00 Alimenta'!$A:$A,$B141,'00 Alimenta'!E:E)*-1)","v":6303229.0099999998}]
["BC","BA0810","da pubblico (Aziende sanitarie pubbliche della Regione)","C",{"$f":"IF('00 Aggregatore'!$D142=\"R\",SUMIF('00 Alimenta'!$A:$A,$B142,'00 Alimenta'!D:D),SUMIF('00 Alimenta'!$A:$A,$B142,'00 Alimenta'!D:D)*-1)","v":28230091.68},{"$f":"IF('00 Aggregatore'!$D142=\"R\",SUMIF('00 Alimenta'!$A:$A,$B142,'00 Alimenta'!E:E),SUMIF('00 Alimenta'!$A:$A,$B142,'00 Alimenta'!E:E)*-1)","v":26481532.390000001}]
["BC","BA0820","da pubblico (altri soggetti pubblici della Regione)","C",{"$f":"IF('00 Aggregatore'!$D143=\"R\",SUMIF('00 Alimenta'!$A:$A,$B143,'00 Alimenta'!D:D),SUMIF('00 Alimenta'!$A:$A,$B143,'00 Alimenta'!D:D)*-1)","v":0},{"$f":"IF('00 Aggregatore'!$D143=\"R\",SUMIF('00 Alimenta'!$A:$A,$B143,'00 Alimenta'!E:E),SUMIF('00 Alimenta'!$A:$A,$B143,'00 Alimenta'!E:E)*-1)","v":0}]
["BC","BA0830","da pubblico (extra Regione)","C",{"$f":"IF('00 Aggregatore'!$D144=\"R\",SUMIF('00 Alimenta'!$A:$A,$B144,'00 Alimenta'!D:D),SUMIF('00 Alimenta'!$A:$A,$B144,'00 Alimenta'!D:D)*-1)","v":23048879.050000001},{"$f":"IF('00 Aggregatore'!$D144=\"R\",SUMIF('00 Alimenta'!$A:$A,$B144,'00 Alimenta'!E:E),SUMIF('00 Alimenta'!$A:$A,$B144,'00 Alimenta'!E:E)*-1)","v":24057993.460000001}]
["BC","BA0850","Servizi sanitari per assistenza ospedaliera da IRCCS privati e Policlinici privati","C",{"$f":"IF('00 Aggregatore'!$D145=\"R\",SUMIF('00 Alimenta'!$A:$A,$B145,'00 Alimenta'!D:D),SUMIF('00 Alimenta'!$A:$A,$B145,'00 Alimenta'!D:D)*-1)","v":0},{"$f":"IF('00 Aggregatore'!$D145=\"R\",SUMIF('00 Alimenta'!$A:$A,$B145,'00 Alimenta'!E:E),SUMIF('00 Alimenta'!$A:$A,$B145,'00 Alimenta'!E:E)*-1)","v":0}]
["BC","BA0860","Servizi sanitari per assistenza ospedaliera da Ospedali Classificati privati","C",{"$f":"IF('00 Aggregatore'!$D146=\"R\",SUMIF('00 Alimenta'!$A:$A,$B146,'00 Alimenta'!D:D),SUMIF('00 Alimenta'!$A:$A,$B146,'00 Alimenta'!D:D)*-1)","v":0},{"$f":"IF('00 Aggregatore'!$D146=\"R\",SUMIF('00 Alimenta'!$A:$A,$B146,'00 Alimenta'!E:E),SUMIF('00 Alimenta'!$A:$A,$B146,'00 Alimenta'!E:E)*-1)","v":0}]
["BC","BA0870","Servizi sanitari per assistenza ospedaliera da Case di Cura private","C",{"$f":"IF('00 Aggregatore'!$D147=\"R\",SUMIF('00 Alimenta'!$A:$A,$B147,'00 Alimenta'!D:D),SUMIF('00 Alimenta'!$A:$A,$B147,'00 Alimenta'!D:D)*-1)","v":61809764.719999999},{"$f":"IF('00 Aggregatore'!$D147=\"R\",SUMIF('00 Alimenta'!$A:$A,$B147,'00 Alimenta'!E:E),SUMIF('00 Alimenta'!$A:$A,$B147,'00 Alimenta'!E:E)*-1)","v":62664028.379999995}]
["BC","BA0880","Servizi sanitari per assistenza ospedaliera da altri privati","C",{"$f":"IF('00 Aggregatore'!$D148=\"R\",SUMIF('00 Alimenta'!$A:$A,$B148,'00 Alimenta'!D:D),SUMIF('00 Alimenta'!$A:$A,$B148,'00 Alimenta'!D:D)*-1)","v":0},{"$f":"IF('00 Aggregatore'!$D148=\"R\",SUMIF('00 Alimenta'!$A:$A,$B148,'00 Alimenta'!E:E),SUMIF('00 Alimenta'!$A:$A,$B148,'00 Alimenta'!E:E)*-1)","v":0}]
["BC","BA0890","da privato per cittadini non residenti - extra Regione (mobilità attiva in compensazione)","C",{"$f":"IF('00 Aggregatore'!$D149=\"R\",SUMIF('00 Alimenta'!$A:$A,$B149,'00 Alimenta'!D:D),SUMIF('00 Alimenta'!$A:$A,$B149,'00 Alimenta'!D:D)*-1)","v":11917704.07},{"$f":"IF('00 Aggregatore'!$D149=\"R\",SUMIF('00 Alimenta'!$A:$A,$B149,'00 Alimenta'!E:E),SUMIF('00 Alimenta'!$A:$A,$B149,'00 Alimenta'!E:E)*-1)","v":10285883.140000001}]
["BC","BA0910","da pubblico (Aziende sanitarie pubbliche della Regione)","C",{"$f":"IF('00 Aggregatore'!$D150=\"R\",SUMIF('00 Alimenta'!$A:$A,$B150,'00 Alimenta'!D:D),SUMIF('00 Alimenta'!$A:$A,$B150,'00 Alimenta'!D:D)*-1)","v":1648164.66},{"$f":"IF('00 Aggregatore'!$D150=\"R\",SUMIF('00 Alimenta'!$A:$A,$B150,'00 Alimenta'!E:E),SUMIF('00 Alimenta'!$A:$A,$B150,'00 Alimenta'!E:E)*-1)","v":1551575.5}]
["BC","BA0920","da pubblico (altri soggetti pubblici della Regione)","C",{"$f":"IF('00 Aggregatore'!$D151=\"R\",SUMIF('00 Alimenta'!$A:$A,$B151,'00 Alimenta'!D:D),SUMIF('00 Alimenta'!$A:$A,$B151,'00 Alimenta'!D:D)*-1)","v":0},{"$f":"IF('00 Aggregatore'!$D151=\"R\",SUMIF('00 Alimenta'!$A:$A,$B151,'00 Alimenta'!E:E),SUMIF('00 Alimenta'!$A:$A,$B151,'00 Alimenta'!E:E)*-1)","v":0}]
["BC","BA0930","da pubblico (extra Regione) - Non soggette a compensazione","C",{"$f":"IF('00 Aggregatore'!$D152=\"R\",SUMIF('00 Alimenta'!$A:$A,$B152,'00 Alimenta'!D:D),SUMIF('00 Alimenta'!$A:$A,$B152,'00 Alimenta'!D:D)*-1)","v":6667},{"$f":"IF('00 Aggregatore'!$D152=\"R\",SUMIF('00 Alimenta'!$A:$A,$B152,'00 Alimenta'!E:E),SUMIF('00 Alimenta'!$A:$A,$B152,'00 Alimenta'!E:E)*-1)","v":81781.600000000006}]
["BC","BA0940","da privato (intraregionale)","C",{"$f":"IF('00 Aggregatore'!$D153=\"R\",SUMIF('00 Alimenta'!$A:$A,$B153,'00 Alimenta'!D:D),SUMIF('00 Alimenta'!$A:$A,$B153,'00 Alimenta'!D:D)*-1)","v":9671880.5899999999},{"$f":"IF('00 Aggregatore'!$D153=\"R\",SUMIF('00 Alimenta'!$A:$A,$B153,'00 Alimenta'!E:E),SUMIF('00 Alimenta'!$A:$A,$B153,'00 Alimenta'!E:E)*-1)","v":9798519.8400000017}]
["BC","BA0950","da privato (extraregionale)","C",{"$f":"IF('00 Aggregatore'!$D154=\"R\",SUMIF('00 Alimenta'!$A:$A,$B154,'00 Alimenta'!D:D),SUMIF('00 Alimenta'!$A:$A,$B154,'00 Alimenta'!D:D)*-1)","v":1872398.81},{"$f":"IF('00 Aggregatore'!$D154=\"R\",SUMIF('00 Alimenta'!$A:$A,$B154,'00 Alimenta'!E:E),SUMIF('00 Alimenta'!$A:$A,$B154,'00 Alimenta'!E:E)*-1)","v":1589885.46}]
["BC","BA0970","da pubblico (Aziende sanitarie pubbliche della Regione) - Mobilità intraregionale","C",{"$f":"IF('00 Aggregatore'!$D155=\"R\",SUMIF('00 Alimenta'!$A:$A,$B155,'00 Alimenta'!D:D),SUMIF('00 Alimenta'!$A:$A,$B155,'00 Alimenta'!D:D)*-1)","v":4391409.7},{"$f":"IF('00 Aggregatore'!$D155=\"R\",SUMIF('00 Alimenta'!$A:$A,$B155,'00 Alimenta'!E:E),SUMIF('00 Alimenta'!$A:$A,$B155,'00 Alimenta'!E:E)*-1)","v":4464112.37}]
["BC","BA0980","da pubblico (altri soggetti pubblici della Regione)","C",{"$f":"IF('00 Aggregatore'!$D156=\"R\",SUMIF('00 Alimenta'!$A:$A,$B156,'00 Alimenta'!D:D),SUMIF('00 Alimenta'!$A:$A,$B156,'00 Alimenta'!D:D)*-1)","v":0},{"$f":"IF('00 Aggregatore'!$D156=\"R\",SUMIF('00 Alimenta'!$A:$A,$B156,'00 Alimenta'!E:E),SUMIF('00 Alimenta'!$A:$A,$B156,'00 Alimenta'!E:E)*-1)","v":0}]
["BC","BA0990","da pubblico (extra Regione)","C",{"$f":"IF('00 Aggregatore'!$D157=\"R\",SUMIF('00 Alimenta'!$A:$A,$B157,'00 Alimenta'!D:D),SUMIF('00 Alimenta'!$A:$A,$B157,'00 Alimenta'!D:D)*-1)","v":1585422.33},{"$f":"IF('00 Aggregatore'!$D157=\"R\",SUMIF('00 Alimenta'!$A:$A,$B157,'00 Alimenta'!E:E),SUMIF('00 Alimenta'!$A:$A,$B157,'00 Alimenta'!E:E)*-1)","v":2195879.04}]
["BC","BA1000","da privato (intraregionale)","C",{"$f":"IF('00 Aggregatore'!$D158=\"R\",SUMIF('00 Alimenta'!$A:$A,$B158,'00 Alimenta'!D:D),SUMIF('00 Alimenta'!$A:$A,$B158,'00 Alimenta'!D:D)*-1)","v":0},{"$f":"IF('00 Aggregatore'!$D158=\"R\",SUMIF('00 Alimenta'!$A:$A,$B158,'00 Alimenta'!E:E),SUMIF('00 Alimenta'!$A:$A,$B158,'00 Alimenta'!E:E)*-1)","v":432985.28}]
["BC","BA1010","da privato (extraregionale)","C",{"$f":"IF('00 Aggregatore'!$D159=\"R\",SUMIF('00 Alimenta'!$A:$A,$B159,'00 Alimenta'!D:D),SUMIF('00 Alimenta'!$A:$A,$B159,'00 Alimenta'!D:D)*-1)","v":0},{"$f":"IF('00 Aggregatore'!$D159=\"R\",SUMIF('00 Alimenta'!$A:$A,$B159,'00 Alimenta'!E:E),SUMIF('00 Alimenta'!$A:$A,$B159,'00 Alimenta'!E:E)*-1)","v":0}]
["BC","BA1020","da privato per cittadini non residenti - extra Regione (mobilità attiva in compensazione)","C",{"$f":"IF('00 Aggregatore'!$D160=\"R\",SUMIF('00 Alimenta'!$A:$A,$B160,'00 Alimenta'!D:D),SUMIF('00 Alimenta'!$A:$A,$B160,'00 Alimenta'!D:D)*-1)","v":0},{"$f":"IF('00 Aggregatore'!$D160=\"R\",SUMIF('00 Alimenta'!$A:$A,$B160,'00 Alimenta'!E:E),SUMIF('00 Alimenta'!$A:$A,$B160,'00 Alimenta'!E:E)*-1)","v":0}]
["BC","BA1040","da pubblico (Aziende sanitarie pubbliche della Regione) - Mobilità intraregionale","C",{"$f":"IF('00 Aggregatore'!$D161=\"R\",SUMIF('00 Alimenta'!$A:$A,$B161,'00 Alimenta'!D:D),SUMIF('00 Alimenta'!$A:$A,$B161,'00 Alimenta'!D:D)*-1)","v":0},{"$f":"IF('00 Aggregatore'!$D161=\"R\",SUMIF('00 Alimenta'!$A:$A,$B161,'00 Alimenta'!E:E),SUMIF('00 Alimenta'!$A:$A,$B161,'00 Alimenta'!E:E)*-1)","v":0}]
["BC","BA1050","da pubblico (altri soggetti pubblici della Regione)","C",{"$f":"IF('00 Aggregatore'!$D162=\"R\",SUMIF('00 Alimenta'!$A:$A,$B162,'00 Alimenta'!D:D),SUMIF('00 Alimenta'!$A:$A,$B162,'00 Alimenta'!D:D)*-1)","v":0},{"$f":"IF('00 Aggregatore'!$D162=\"R\",SUMIF('00 Alimenta'!$A:$A,$B162,'00 Alimenta'!E:E),SUMIF('00 Alimenta'!$A:$A,$B162,'00 Alimenta'!E:E)*-1)","v":0}]
["BC","BA1060","da pubblico (extra Regione)","C",{"$f":"IF('00 Aggregatore'!$D163=\"R\",SUMIF('00 Alimenta'!$A:$A,$B163,'00 Alimenta'!D:D),SUMIF('00 Alimenta'!$A:$A,$B163,'00 Alimenta'!D:D)*-1)","v":159884.29},{"$f":"IF('00 Aggregatore'!$D163=\"R\",SUMIF('00 Alimenta'!$A:$A,$B163,'00 Alimenta'!E:E),SUMIF('00 Alimenta'!$A:$A,$B163,'00 Alimenta'!E:E)*-1)","v":95302.31}]
["BC","BA1070","da privato","C",{"$f":"IF('00 Aggregatore'!$D164=\"R\",SUMIF('00 Alimenta'!$A:$A,$B164,'00 Alimenta'!D:D),SUMIF('00 Alimenta'!$A:$A,$B164,'00 Alimenta'!D:D)*-1)","v":1888589.9699999997},{"$f":"IF('00 Aggregatore'!$D164=\"R\",SUMIF('00 Alimenta'!$A:$A,$B164,'00 Alimenta'!E:E),SUMIF('00 Alimenta'!$A:$A,$B164,'00 Alimenta'!E:E)*-1)","v":1821580.51}]
["BC","BA1080","da privato per cittadini non residenti - extra Regione (mobilità attiva in compensazione)","C",{"$f":"IF('00 Aggregatore'!$D165=\"R\",SUMIF('00 Alimenta'!$A:$A,$B165,'00 Alimenta'!D:D),SUMIF('00 Alimenta'!$A:$A,$B165,'00 Alimenta'!D:D)*-1)","v":240189.57},{"$f":"IF('00 Aggregatore'!$D165=\"R\",SUMIF('00 Alimenta'!$A:$A,$B165,'00 Alimenta'!E:E),SUMIF('00 Alimenta'!$A:$A,$B165,'00 Alimenta'!E:E)*-1)","v":232622.88999999998}]
["BC","BA1100","da pubblico (Aziende sanitarie pubbliche della Regione) - Mobilità intraregionale","C",{"$f":"IF('00 Aggregatore'!$D166=\"R\",SUMIF('00 Alimenta'!$A:$A,$B166,'00 Alimenta'!D:D),SUMIF('00 Alimenta'!$A:$A,$B166,'00 Alimenta'!D:D)*-1)","v":124342.79},{"$f":"IF('00 Aggregatore'!$D166=\"R\",SUMIF('00 Alimenta'!$A:$A,$B166,'00 Alimenta'!E:E),SUMIF('00 Alimenta'!$A:$A,$B166,'00 Alimenta'!E:E)*-1)","v":103216}]
["BC","BA1110","da pubblico (altri soggetti pubblici della Regione)","C",{"$f":"IF('00 Aggregatore'!$D167=\"R\",SUMIF('00 Alimenta'!$A:$A,$B167,'00 Alimenta'!D:D),SUMIF('00 Alimenta'!$A:$A,$B167,'00 Alimenta'!D:D)*-1)","v":0},{"$f":"IF('00 Aggregatore'!$D167=\"R\",SUMIF('00 Alimenta'!$A:$A,$B167,'00 Alimenta'!E:E),SUMIF('00 Alimenta'!$A:$A,$B167,'00 Alimenta'!E:E)*-1)","v":0}]
["BC","BA1120","da pubblico (extra Regione)","C",{"$f":"IF('00 Aggregatore'!$D168=\"R\",SUMIF('00 Alimenta'!$A:$A,$B168,'00 Alimenta'!D:D),SUMIF('00 Alimenta'!$A:$A,$B168,'00 Alimenta'!D:D)*-1)","v":228483.68},{"$f":"IF('00 Aggregatore'!$D168=\"R\",SUMIF('00 Alimenta'!$A:$A,$B168,'00 Alimenta'!E:E),SUMIF('00 Alimenta'!$A:$A,$B168,'00 Alimenta'!E:E)*-1)","v":344124.9}]
["BC","BA1130","da privato","C",{"$f":"IF('00 Aggregatore'!$D169=\"R\",SUMIF('00 Alimenta'!$A:$A,$B169,'00 Alimenta'!D:D),SUMIF('00 Alimenta'!$A:$A,$B169,'00 Alimenta'!D:D)*-1)","v":8159911.3799999999},{"$f":"IF('00 Aggregatore'!$D169=\"R\",SUMIF('00 Alimenta'!$A:$A,$B169,'00 Alimenta'!E:E),SUMIF('00 Alimenta'!$A:$A,$B169,'00 Alimenta'!E:E)*-1)","v":8336001.5599999996}]
["BC","BA1150","da pubblico (Aziende sanitarie pubbliche della Regione) - Mobilità intraregionale","C",{"$f":"IF('00 Aggregatore'!$D170=\"R\",SUMIF('00 Alimenta'!$A:$A,$B170,'00 Alimenta'!D:D),SUMIF('00 Alimenta'!$A:$A,$B170,'00 Alimenta'!D:D)*-1)","v":1737461.12},{"$f":"IF('00 Aggregatore'!$D170=\"R\",SUMIF('00 Alimenta'!$A:$A,$B170,'00 Alimenta'!E:E),SUMIF('00 Alimenta'!$A:$A,$B170,'00 Alimenta'!E:E)*-1)","v":1758520.3800000001}]
["BC","BA1160","da pubblico (altri soggetti pubblici della Regione)","C",{"$f":"IF('00 Aggregatore'!$D171=\"R\",SUMIF('00 Alimenta'!$A:$A,$B171,'00 Alimenta'!D:D),SUMIF('00 Alimenta'!$A:$A,$B171,'00 Alimenta'!D:D)*-1)","v":0},{"$f":"IF('00 Aggregatore'!$D171=\"R\",SUMIF('00 Alimenta'!$A:$A,$B171,'00 Alimenta'!E:E),SUMIF('00 Alimenta'!$A:$A,$B171,'00 Alimenta'!E:E)*-1)","v":0}]
["BC","BA1170","da pubblico (extra Regione) non soggette a compensazione","C",{"$f":"IF('00 Aggregatore'!$D172=\"R\",SUMIF('00 Alimenta'!$A:$A,$B172,'00 Alimenta'!D:D),SUMIF('00 Alimenta'!$A:$A,$B172,'00 Alimenta'!D:D)*-1)","v":168459.48},{"$f":"IF('00 Aggregatore'!$D172=\"R\",SUMIF('00 Alimenta'!$A:$A,$B172,'00 Alimenta'!E:E),SUMIF('00 Alimenta'!$A:$A,$B172,'00 Alimenta'!E:E)*-1)","v":160969.38}]
["BC","BA1180","da privato (intraregionale)","C",{"$f":"IF('00 Aggregatore'!$D173=\"R\",SUMIF('00 Alimenta'!$A:$A,$B173,'00 Alimenta'!D:D),SUMIF('00 Alimenta'!$A:$A,$B173,'00 Alimenta'!D:D)*-1)","v":12551624.019999998},{"$f":"IF('00 Aggregatore'!$D173=\"R\",SUMIF('00 Alimenta'!$A:$A,$B173,'00 Alimenta'!E:E),SUMIF('00 Alimenta'!$A:$A,$B173,'00 Alimenta'!E:E)*-1)","v":12500635.899999999}]
["BC","BA1190","da privato (extraregionale)","C",{"$f":"IF('00 Aggregatore'!$D174=\"R\",SUMIF('00 Alimenta'!$A:$A,$B174,'00 Alimenta'!D:D),SUMIF('00 Alimenta'!$A:$A,$B174,'00 Alimenta'!D:D)*-1)","v":1751767.75},{"$f":"IF('00 Aggregatore'!$D174=\"R\",SUMIF('00 Alimenta'!$A:$A,$B174,'00 Alimenta'!E:E),SUMIF('00 Alimenta'!$A:$A,$B174,'00 Alimenta'!E:E)*-1)","v":1887412.9100000001}]
["BC","BA1210","Compartecipazione al personale per attività libero professionale intramoenia - Area ospedaliera","C",{"$f":"IF('00 Aggregatore'!$D175=\"R\",SUMIF('00 Alimenta'!$A:$A,$B175,'00 Alimenta'!D:D),SUMIF('00 Alimenta'!$A:$A,$B175,'00 Alimenta'!D:D)*-1)","v":36801.340000000004},{"$f":"IF('00 Aggregatore'!$D175=\"R\",SUMIF('00 Alimenta'!$A:$A,$B175,'00 Alimenta'!E:E),SUMIF('00 Alimenta'!$A:$A,$B175,'00 Alimenta'!E:E)*-1)","v":54218.100000000006}]
["BC","BA1220","Compartecipazione al personale per attività libero professionale intramoenia - Area specialistica","C",{"$f":"IF('00 Aggregatore'!$D176=\"R\",SUMIF('00 Alimenta'!$A:$A,$B176,'00 Alimenta'!D:D),SUMIF('00 Alimenta'!$A:$A,$B176,'00 Alimenta'!D:D)*-1)","v":2790651.77},{"$f":"IF('00 Aggregatore'!$D176=\"R\",SUMIF('00 Alimenta'!$A:$A,$B176,'00 Alimenta'!E:E),SUMIF('00 Alimenta'!$A:$A,$B176,'00 Alimenta'!E:E)*-1)","v":2563747.4700000002}]
["BC","BA1230","Compartecipazione al personale per attività libero professionale intramoenia - Area sanità pubblica","C",{"$f":"IF('00 Aggregatore'!$D177=\"R\",SUMIF('00 Alimenta'!$A:$A,$B177,'00 Alimenta'!D:D),SUMIF('00 Alimenta'!$A:$A,$B177,'00 Alimenta'!D:D)*-1)","v":19073.689999999999},{"$f":"IF('00 Aggregatore'!$D177=\"R\",SUMIF('00 Alimenta'!$A:$A,$B177,'00 Alimenta'!E:E),SUMIF('00 Alimenta'!$A:$A,$B177,'00 Alimenta'!E:E)*-1)","v":15233.61}]
["BC","BA1240","Compartecipazione al personale per attività libero professionale intramoenia - Consulenze (ex art.55 c.1 lett.c), d) ed ex art.57-58)","C",{"$f":"IF('00 Aggregatore'!$D178=\"R\",SUMIF('00 Alimenta'!$A:$A,$B178,'00 Alimenta'!D:D),SUMIF('00 Alimenta'!$A:$A,$B178,'00 Alimenta'!D:D)*-1)","v":371493.34},{"$f":"IF('00 Aggregatore'!$D178=\"R\",SUMIF('00 Alimenta'!$A:$A,$B178,'00 Alimenta'!E:E),SUMIF('00 Alimenta'!$A:$A,$B178,'00 Alimenta'!E:E)*-1)","v":579327.30000000005}]
["BC","BA1250","Compartecipazione al personale per attività libero prof.le intramoenia - Consulenze (ex art.55 c.1 lett.c), d) ed ex art.57-58) (Az.San.Pubbl.Regione)","C",{"$f":"IF('00 Aggregatore'!$D179=\"R\",SUMIF('00 Alimenta'!$A:$A,$B179,'00 Alimenta'!D:D),SUMIF('00 Alimenta'!$A:$A,$B179,'00 Alimenta'!D:D)*-1)","v":0},{"$f":"IF('00 Aggregatore'!$D179=\"R\",SUMIF('00 Alimenta'!$A:$A,$B179,'00 Alimenta'!E:E),SUMIF('00 Alimenta'!$A:$A,$B179,'00 Alimenta'!E:E)*-1)","v":0}]
["BC","BA1260","Compartecipazione al personale per attività libero professionale intramoenia - Altro","C",{"$f":"IF('00 Aggregatore'!$D180=\"R\",SUMIF('00 Alimenta'!$A:$A,$B180,'00 Alimenta'!D:D),SUMIF('00 Alimenta'!$A:$A,$B180,'00 Alimenta'!D:D)*-1)","v":75468.47},{"$f":"IF('00 Aggregatore'!$D180=\"R\",SUMIF('00 Alimenta'!$A:$A,$B180,'00 Alimenta'!E:E),SUMIF('00 Alimenta'!$A:$A,$B180,'00 Alimenta'!E:E)*-1)","v":108504.84}]
["BC","BA1270","Compartecipazione al personale per attività libero professionale intramoenia - Altro (Aziende sanitarie pubbliche della Regione)","C",{"$f":"IF('00 Aggregatore'!$D181=\"R\",SUMIF('00 Alimenta'!$A:$A,$B181,'00 Alimenta'!D:D),SUMIF('00 Alimenta'!$A:$A,$B181,'00 Alimenta'!D:D)*-1)","v":0},{"$f":"IF('00 Aggregatore'!$D181=\"R\",SUMIF('00 Alimenta'!$A:$A,$B181,'00 Alimenta'!E:E),SUMIF('00 Alimenta'!$A:$A,$B181,'00 Alimenta'!E:E)*-1)","v":0}]
["BC","BA1290","Contributi ad associazioni di volontariato","C",{"$f":"IF('00 Aggregatore'!$D182=\"R\",SUMIF('00 Alimenta'!$A:$A,$B182,'00 Alimenta'!D:D),SUMIF('00 Alimenta'!$A:$A,$B182,'00 Alimenta'!D:D)*-1)","v":326600},{"$f":"IF('00 Aggregatore'!$D182=\"R\",SUMIF('00 Alimenta'!$A:$A,$B182,'00 Alimenta'!E:E),SUMIF('00 Alimenta'!$A:$A,$B182,'00 Alimenta'!E:E)*-1)","v":349365.76000000001}]
["BC","BA1300","Rimborsi per cure all'estero","C",{"$f":"IF('00 Aggregatore'!$D183=\"R\",SUMIF('00 Alimenta'!$A:$A,$B183,'00 Alimenta'!D:D),SUMIF('00 Alimenta'!$A:$A,$B183,'00 Alimenta'!D:D)*-1)","v":0},{"$f":"IF('00 Aggregatore'!$D183=\"R\",SUMIF('00 Alimenta'!$A:$A,$B183,'00 Alimenta'!E:E),SUMIF('00 Alimenta'!$A:$A,$B183,'00 Alimenta'!E:E)*-1)","v":2069.39}]
["BC","BA1310","Contributi a società partecipate e/o enti dipendenti della Regione","C",{"$f":"IF('00 Aggregatore'!$D184=\"R\",SUMIF('00 Alimenta'!$A:$A,$B184,'00 Alimenta'!D:D),SUMIF('00 Alimenta'!$A:$A,$B184,'00 Alimenta'!D:D)*-1)","v":0},{"$f":"IF('00 Aggregatore'!$D184=\"R\",SUMIF('00 Alimenta'!$A:$A,$B184,'00 Alimenta'!E:E),SUMIF('00 Alimenta'!$A:$A,$B184,'00 Alimenta'!E:E)*-1)","v":0}]
["BC","BA1320","Contributo Legge 210/92","C",{"$f":"IF('00 Aggregatore'!$D185=\"R\",SUMIF('00 Alimenta'!$A:$A,$B185,'00 Alimenta'!D:D),SUMIF('00 Alimenta'!$A:$A,$B185,'00 Alimenta'!D:D)*-1)","v":0},{"$f":"IF('00 Aggregatore'!$D185=\"R\",SUMIF('00 Alimenta'!$A:$A,$B185,'00 Alimenta'!E:E),SUMIF('00 Alimenta'!$A:$A,$B185,'00 Alimenta'!E:E)*-1)","v":0}]
["BC","BA1330","Altri rimborsi, assegni e contributi","C",{"$f":"IF('00 Aggregatore'!$D186=\"R\",SUMIF('00 Alimenta'!$A:$A,$B186,'00 Alimenta'!D:D),SUMIF('00 Alimenta'!$A:$A,$B186,'00 Alimenta'!D:D)*-1)","v":1424508.4500000002},{"$f":"IF('00 Aggregatore'!$D186=\"R\",SUMIF('00 Alimenta'!$A:$A,$B186,'00 Alimenta'!E:E),SUMIF('00 Alimenta'!$A:$A,$B186,'00 Alimenta'!E:E)*-1)","v":1792525.6300000001}]
["BC","BA1340","Rimborsi, assegni e contributi v/Aziende sanitarie pubbliche della Regione","C",{"$f":"IF('00 Aggregatore'!$D187=\"R\",SUMIF('00 Alimenta'!$A:$A,$B187,'00 Alimenta'!D:D),SUMIF('00 Alimenta'!$A:$A,$B187,'00 Alimenta'!D:D)*-1)","v":80},{"$f":"IF('00 Aggregatore'!$D187=\"R\",SUMIF('00 Alimenta'!$A:$A,$B187,'00 Alimenta'!E:E),SUMIF('00 Alimenta'!$A:$A,$B187,'00 Alimenta'!E:E)*-1)","v":0}]
["BC","BA1360","Consulenze sanitarie e socio-sanitarie da Aziende sanitarie pubbliche della Regione","C",{"$f":"IF('00 Aggregatore'!$D188=\"R\",SUMIF('00 Alimenta'!$A:$A,$B188,'00 Alimenta'!D:D),SUMIF('00 Alimenta'!$A:$A,$B188,'00 Alimenta'!D:D)*-1)","v":298526.69},{"$f":"IF('00 Aggregatore'!$D188=\"R\",SUMIF('00 Alimenta'!$A:$A,$B188,'00 Alimenta'!E:E),SUMIF('00 Alimenta'!$A:$A,$B188,'00 Alimenta'!E:E)*-1)","v":416373.3}]
["BC","BA1370","Consulenze sanitarie e socio-sanitarie da terzi - Altri soggetti pubblici","C",{"$f":"IF('00 Aggregatore'!$D189=\"R\",SUMIF('00 Alimenta'!$A:$A,$B189,'00 Alimenta'!D:D),SUMIF('00 Alimenta'!$A:$A,$B189,'00 Alimenta'!D:D)*-1)","v":24433.75},{"$f":"IF('00 Aggregatore'!$D189=\"R\",SUMIF('00 Alimenta'!$A:$A,$B189,'00 Alimenta'!E:E),SUMIF('00 Alimenta'!$A:$A,$B189,'00 Alimenta'!E:E)*-1)","v":0}]
["BC","BA1390","Consulenze sanitarie da privato - Articolo 55, comma 2, CCNL 8 giugno 2000","C",{"$f":"IF('00 Aggregatore'!$D190=\"R\",SUMIF('00 Alimenta'!$A:$A,$B190,'00 Alimenta'!D:D),SUMIF('00 Alimenta'!$A:$A,$B190,'00 Alimenta'!D:D)*-1)","v":2372315.1800000002},{"$f":"IF('00 Aggregatore'!$D190=\"R\",SUMIF('00 Alimenta'!$A:$A,$B190,'00 Alimenta'!E:E),SUMIF('00 Alimenta'!$A:$A,$B190,'00 Alimenta'!E:E)*-1)","v":2164804.17}]
["BC","BA1400","Altre consulenze sanitarie e socio-sanitarie da privato","C",{"$f":"IF('00 Aggregatore'!$D191=\"R\",SUMIF('00 Alimenta'!$A:$A,$B191,'00 Alimenta'!D:D),SUMIF('00 Alimenta'!$A:$A,$B191,'00 Alimenta'!D:D)*-1)","v":8005.29},{"$f":"IF('00 Aggregatore'!$D191=\"R\",SUMIF('00 Alimenta'!$A:$A,$B191,'00 Alimenta'!E:E),SUMIF('00 Alimenta'!$A:$A,$B191,'00 Alimenta'!E:E)*-1)","v":4381.71}]
["BC","BA1410","Collaborazioni coordinate e continuative sanitarie e socio-sanitarie da privato","C",{"$f":"IF('00 Aggregatore'!$D192=\"R\",SUMIF('00 Alimenta'!$A:$A,$B192,'00 Alimenta'!D:D),SUMIF('00 Alimenta'!$A:$A,$B192,'00 Alimenta'!D:D)*-1)","v":8413.1200000000008},{"$f":"IF('00 Aggregatore'!$D192=\"R\",SUMIF('00 Alimenta'!$A:$A,$B192,'00 Alimenta'!E:E),SUMIF('00 Alimenta'!$A:$A,$B192,'00 Alimenta'!E:E)*-1)","v":0}]
["BC","BA1420","Indennità a personale universitario - Area sanitaria","C",{"$f":"IF('00 Aggregatore'!$D193=\"R\",SUMIF('00 Alimenta'!$A:$A,$B193,'00 Alimenta'!D:D),SUMIF('00 Alimenta'!$A:$A,$B193,'00 Alimenta'!D:D)*-1)","v":242210.34},{"$f":"IF('00 Aggregatore'!$D193=\"R\",SUMIF('00 Alimenta'!$A:$A,$B193,'00 Alimenta'!E:E),SUMIF('00 Alimenta'!$A:$A,$B193,'00 Alimenta'!E:E)*-1)","v":256736.03}]
["BC","BA1430","Lavoro interinale - Area sanitaria","C",{"$f":"IF('00 Aggregatore'!$D194=\"R\",SUMIF('00 Alimenta'!$A:$A,$B194,'00 Alimenta'!D:D),SUMIF('00 Alimenta'!$A:$A,$B194,'00 Alimenta'!D:D)*-1)","v":2608784.9},{"$f":"IF('00 Aggregatore'!$D194=\"R\",SUMIF('00 Alimenta'!$A:$A,$B194,'00 Alimenta'!E:E),SUMIF('00 Alimenta'!$A:$A,$B194,'00 Alimenta'!E:E)*-1)","v":2862789.15}]
["BC","BA1440","Altre collaborazioni e prestazioni di lavoro - Area sanitaria","C",{"$f":"IF('00 Aggregatore'!$D195=\"R\",SUMIF('00 Alimenta'!$A:$A,$B195,'00 Alimenta'!D:D),SUMIF('00 Alimenta'!$A:$A,$B195,'00 Alimenta'!D:D)*-1)","v":1150772.0999999999},{"$f":"IF('00 Aggregatore'!$D195=\"R\",SUMIF('00 Alimenta'!$A:$A,$B195,'00 Alimenta'!E:E),SUMIF('00 Alimenta'!$A:$A,$B195,'00 Alimenta'!E:E)*-1)","v":815766.76}]
["BC","BA1460","Rimborso oneri stipendiali personale sanitario in comando da Aziende sanitarie pubbliche della Regione","C",{"$f":"IF('00 Aggregatore'!$D196=\"R\",SUMIF('00 Alimenta'!$A:$A,$B196,'00 Alimenta'!D:D),SUMIF('00 Alimenta'!$A:$A,$B196,'00 Alimenta'!D:D)*-1)","v":0},{"$f":"IF('00 Aggregatore'!$D196=\"R\",SUMIF('00 Alimenta'!$A:$A,$B196,'00 Alimenta'!E:E),SUMIF('00 Alimenta'!$A:$A,$B196,'00 Alimenta'!E:E)*-1)","v":0}]
["BC","BA1470","Rimborso oneri stipendiali personale sanitario in comando da Regioni, soggetti pubblici e da Università","C",{"$f":"IF('00 Aggregatore'!$D197=\"R\",SUMIF('00 Alimenta'!$A:$A,$B197,'00 Alimenta'!D:D),SUMIF('00 Alimenta'!$A:$A,$B197,'00 Alimenta'!D:D)*-1)","v":0},{"$f":"IF('00 Aggregatore'!$D197=\"R\",SUMIF('00 Alimenta'!$A:$A,$B197,'00 Alimenta'!E:E),SUMIF('00 Alimenta'!$A:$A,$B197,'00 Alimenta'!E:E)*-1)","v":0}]
[{"$f":"LEFT(B198,1)&D198","v":"BC"},"BA1480","Rimborso oneri stipendiali personale sanitario in comando da Aziende di altre Regioni (extra Regione)","C",{"$f":"IF('00 Aggregatore'!$D198=\"R\",SUMIF('00 Alimenta'!$A:$A,$B198,'00 Alimenta'!D:D),SUMIF('00 Alimenta'!$A:$A,$B198,'00 Alimenta'!D:D)*-1)","v":9790.09},{"$f":"IF('00 Aggregatore'!$D198=\"R\",SUMIF('00 Alimenta'!$A:$A,$B198,'00 Alimenta'!E:E),SUMIF('00 Alimenta'!$A:$A,$B198,'00 Alimenta'!E:E)*-1)","v":53987.92}]
["BC","BA1500","Altri servizi sanitari e sociosanitari a rilevanza sanitaria da pubblico - Aziende sanitarie pubbliche della Regione","C",{"$f":"IF('00 Aggregatore'!$D199=\"R\",SUMIF('00 Alimenta'!$A:$A,$B199,'00 Alimenta'!D:D),SUMIF('00 Alimenta'!$A:$A,$B199,'00 Alimenta'!D:D)*-1)","v":13109.54},{"$f":"IF('00 Aggregatore'!$D199=\"R\",SUMIF('00 Alimenta'!$A:$A,$B199,'00 Alimenta'!E:E),SUMIF('00 Alimenta'!$A:$A,$B199,'00 Alimenta'!E:E)*-1)","v":0}]
["BC","BA1510","Altri servizi sanitari e sociosanitari a rilevanza sanitaria da pubblico - Altri soggetti pubblici della Regione","C",{"$f":"IF('00 Aggregatore'!$D200=\"R\",SUMIF('00 Alimenta'!$A:$A,$B200,'00 Alimenta'!D:D),SUMIF('00 Alimenta'!$A:$A,$B200,'00 Alimenta'!D:D)*-1)","v":0},{"$f":"IF('00 Aggregatore'!$D200=\"R\",SUMIF('00 Alimenta'!$A:$A,$B200,'00 Alimenta'!E:E),SUMIF('00 Alimenta'!$A:$A,$B200,'00 Alimenta'!E:E)*-1)","v":0}]
["BC","BA1520","Altri servizi sanitari e sociosanitari a rilevanza sanitaria da pubblico (extra Regione)","C",{"$f":"IF('00 Aggregatore'!$D201=\"R\",SUMIF('00 Alimenta'!$A:$A,$B201,'00 Alimenta'!D:D),SUMIF('00 Alimenta'!$A:$A,$B201,'00 Alimenta'!D:D)*-1)","v":0},{"$f":"IF('00 Aggregatore'!$D201=\"R\",SUMIF('00 Alimenta'!$A:$A,$B201,'00 Alimenta'!E:E),SUMIF('00 Alimenta'!$A:$A,$B201,'00 Alimenta'!E:E)*-1)","v":0}]
["BC","BA1530","Altri servizi sanitari da privato","C",{"$f":"IF('00 Aggregatore'!$D202=\"R\",SUMIF('00 Alimenta'!$A:$A,$B202,'00 Alimenta'!D:D),SUMIF('00 Alimenta'!$A:$A,$B202,'00 Alimenta'!D:D)*-1)","v":2741606.08},{"$f":"IF('00 Aggregatore'!$D202=\"R\",SUMIF('00 Alimenta'!$A:$A,$B202,'00 Alimenta'!E:E),SUMIF('00 Alimenta'!$A:$A,$B202,'00 Alimenta'!E:E)*-1)","v":3534647.28}]
["BC","BA1540","Costi per servizi sanitari - Mobilità internazionale passiva","C",{"$f":"IF('00 Aggregatore'!$D203=\"R\",SUMIF('00 Alimenta'!$A:$A,$B203,'00 Alimenta'!D:D),SUMIF('00 Alimenta'!$A:$A,$B203,'00 Alimenta'!D:D)*-1)","v":0},{"$f":"IF('00 Aggregatore'!$D203=\"R\",SUMIF('00 Alimenta'!$A:$A,$B203,'00 Alimenta'!E:E),SUMIF('00 Alimenta'!$A:$A,$B203,'00 Alimenta'!E:E)*-1)","v":2072369.5}]
["BC","BA1550","Costi per differenziale tariffe TUC","C",{"$f":"IF('00 Aggregatore'!$D204=\"R\",SUMIF('00 Alimenta'!$A:$A,$B204,'00 Alimenta'!D:D),SUMIF('00 Alimenta'!$A:$A,$B204,'00 Alimenta'!D:D)*-1)","v":0},{"$f":"IF('00 Aggregatore'!$D204=\"R\",SUMIF('00 Alimenta'!$A:$A,$B204,'00 Alimenta'!E:E),SUMIF('00 Alimenta'!$A:$A,$B204,'00 Alimenta'!E:E)*-1)","v":0}]
["BC","BA1580","Lavanderia","C",{"$f":"IF('00 Aggregatore'!$D205=\"R\",SUMIF('00 Alimenta'!$A:$A,$B205,'00 Alimenta'!D:D),SUMIF('00 Alimenta'!$A:$A,$B205,'00 Alimenta'!D:D)*-1)","v":5274953.32},{"$f":"IF('00 Aggregatore'!$D205=\"R\",SUMIF('00 Alimenta'!$A:$A,$B205,'00 Alimenta'!E:E),SUMIF('00 Alimenta'!$A:$A,$B205,'00 Alimenta'!E:E)*-1)","v":4633285.6399999997}]
["BC","BA1590","Pulizia","C",{"$f":"IF('00 Aggregatore'!$D206=\"R\",SUMIF('00 Alimenta'!$A:$A,$B206,'00 Alimenta'!D:D),SUMIF('00 Alimenta'!$A:$A,$B206,'00 Alimenta'!D:D)*-1)","v":6089443.3399999999},{"$f":"IF('00 Aggregatore'!$D206=\"R\",SUMIF('00 Alimenta'!$A:$A,$B206,'00 Alimenta'!E:E),SUMIF('00 Alimenta'!$A:$A,$B206,'00 Alimenta'!E:E)*-1)","v":6110953.9000000004}]
["BC","BA1600","Mensa","C",{"$f":"IF('00 Aggregatore'!$D207=\"R\",SUMIF('00 Alimenta'!$A:$A,$B207,'00 Alimenta'!D:D),SUMIF('00 Alimenta'!$A:$A,$B207,'00 Alimenta'!D:D)*-1)","v":4117793.49},{"$f":"IF('00 Aggregatore'!$D207=\"R\",SUMIF('00 Alimenta'!$A:$A,$B207,'00 Alimenta'!E:E),SUMIF('00 Alimenta'!$A:$A,$B207,'00 Alimenta'!E:E)*-1)","v":4253494.91}]
["BC","BA1610","Riscaldamento","C",{"$f":"IF('00 Aggregatore'!$D208=\"R\",SUMIF('00 Alimenta'!$A:$A,$B208,'00 Alimenta'!D:D),SUMIF('00 Alimenta'!$A:$A,$B208,'00 Alimenta'!D:D)*-1)","v":1064233.96},{"$f":"IF('00 Aggregatore'!$D208=\"R\",SUMIF('00 Alimenta'!$A:$A,$B208,'00 Alimenta'!E:E),SUMIF('00 Alimenta'!$A:$A,$B208,'00 Alimenta'!E:E)*-1)","v":912590.81}]
["BC","BA1620","Servizi di assistenza informatica","C",{"$f":"IF('00 Aggregatore'!$D209=\"R\",SUMIF('00 Alimenta'!$A:$A,$B209,'00 Alimenta'!D:D),SUMIF('00 Alimenta'!$A:$A,$B209,'00 Alimenta'!D:D)*-1)","v":1666759.65},{"$f":"IF('00 Aggregatore'!$D209=\"R\",SUMIF('00 Alimenta'!$A:$A,$B209,'00 Alimenta'!E:E),SUMIF('00 Alimenta'!$A:$A,$B209,'00 Alimenta'!E:E)*-1)","v":1812783.81}]
["BC","BA1630","Servizi trasporti (non sanitari)","C",{"$f":"IF('00 Aggregatore'!$D210=\"R\",SUMIF('00 Alimenta'!$A:$A,$B210,'00 Alimenta'!D:D),SUMIF('00 Alimenta'!$A:$A,$B210,'00 Alimenta'!D:D)*-1)","v":9272},{"$f":"IF('00 Aggregatore'!$D210=\"R\",SUMIF('00 Alimenta'!$A:$A,$B210,'00 Alimenta'!E:E),SUMIF('00 Alimenta'!$A:$A,$B210,'00 Alimenta'!E:E)*-1)","v":5892.6}]
["BC","BA1640","Smaltimento rifiuti","C",{"$f":"IF('00 Aggregatore'!$D211=\"R\",SUMIF('00 Alimenta'!$A:$A,$B211,'00 Alimenta'!D:D),SUMIF('00 Alimenta'!$A:$A,$B211,'00 Alimenta'!D:D)*-1)","v":1384638.6300000001},{"$f":"IF('00 Aggregatore'!$D211=\"R\",SUMIF('00 Alimenta'!$A:$A,$B211,'00 Alimenta'!E:E),SUMIF('00 Alimenta'!$A:$A,$B211,'00 Alimenta'!E:E)*-1)","v":1392025.82}]
["BC","BA1650","Utenze telefoniche","C",{"$f":"IF('00 Aggregatore'!$D212=\"R\",SUMIF('00 Alimenta'!$A:$A,$B212,'00 Alimenta'!D:D),SUMIF('00 Alimenta'!$A:$A,$B212,'00 Alimenta'!D:D)*-1)","v":524835.69999999995},{"$f":"IF('00 Aggregatore'!$D212=\"R\",SUMIF('00 Alimenta'!$A:$A,$B212,'00 Alimenta'!E:E),SUMIF('00 Alimenta'!$A:$A,$B212,'00 Alimenta'!E:E)*-1)","v":940270.67}]
["BC","BA1660","Utenze elettricità","C",{"$f":"IF('00 Aggregatore'!$D213=\"R\",SUMIF('00 Alimenta'!$A:$A,$B213,'00 Alimenta'!D:D),SUMIF('00 Alimenta'!$A:$A,$B213,'00 Alimenta'!D:D)*-1)","v":3156167.9},{"$f":"IF('00 Aggregatore'!$D213=\"R\",SUMIF('00 Alimenta'!$A:$A,$B213,'00 Alimenta'!E:E),SUMIF('00 Alimenta'!$A:$A,$B213,'00 Alimenta'!E:E)*-1)","v":3337366.78}]
["BC","BA1670","Altre utenze","C",{"$f":"IF('00 Aggregatore'!$D214=\"R\",SUMIF('00 Alimenta'!$A:$A,$B214,'00 Alimenta'!D:D),SUMIF('00 Alimenta'!$A:$A,$B214,'00 Alimenta'!D:D)*-1)","v":705877.73},{"$f":"IF('00 Aggregatore'!$D214=\"R\",SUMIF('00 Alimenta'!$A:$A,$B214,'00 Alimenta'!E:E),SUMIF('00 Alimenta'!$A:$A,$B214,'00 Alimenta'!E:E)*-1)","v":875740.52}]
["BC","BA1690","Premi di assicurazione - R.C. Professionale","C",{"$f":"IF('00 Aggregatore'!$D215=\"R\",SUMIF('00 Alimenta'!$A:$A,$B215,'00 Alimenta'!D:D),SUMIF('00 Alimenta'!$A:$A,$B215,'00 Alimenta'!D:D)*-1)","v":4466553.17},{"$f":"IF('00 Aggregatore'!$D215=\"R\",SUMIF('00 Alimenta'!$A:$A,$B215,'00 Alimenta'!E:E),SUMIF('00 Alimenta'!$A:$A,$B215,'00 Alimenta'!E:E)*-1)","v":4450699.8499999996}]
["BC","BA1700","Premi di assicurazione - Altri premi assicurativi","C",{"$f":"IF('00 Aggregatore'!$D216=\"R\",SUMIF('00 Alimenta'!$A:$A,$B216,'00 Alimenta'!D:D),SUMIF('00 Alimenta'!$A:$A,$B216,'00 Alimenta'!D:D)*-1)","v":343462.87},{"$f":"IF('00 Aggregatore'!$D216=\"R\",SUMIF('00 Alimenta'!$A:$A,$B216,'00 Alimenta'!E:E),SUMIF('00 Alimenta'!$A:$A,$B216,'00 Alimenta'!E:E)*-1)","v":277917.25}]
["BC","BA1720","Altri servizi non sanitari da pubblico (Aziende sanitarie pubbliche della Regione)","C",{"$f":"IF('00 Aggregatore'!$D217=\"R\",SUMIF('00 Alimenta'!$A:$A,$B217,'00 Alimenta'!D:D),SUMIF('00 Alimenta'!$A:$A,$B217,'00 Alimenta'!D:D)*-1)","v":0},{"$f":"IF('00 Aggregatore'!$D217=\"R\",SUMIF('00 Alimenta'!$A:$A,$B217,'00 Alimenta'!E:E),SUMIF('00 Alimenta'!$A:$A,$B217,'00 Alimenta'!E:E)*-1)","v":0}]
["BC","BA1730","Altri servizi non sanitari da altri soggetti pubblici","C",{"$f":"IF('00 Aggregatore'!$D218=\"R\",SUMIF('00 Alimenta'!$A:$A,$B218,'00 Alimenta'!D:D),SUMIF('00 Alimenta'!$A:$A,$B218,'00 Alimenta'!D:D)*-1)","v":0},{"$f":"IF('00 Aggregatore'!$D218=\"R\",SUMIF('00 Alimenta'!$A:$A,$B218,'00 Alimenta'!E:E),SUMIF('00 Alimenta'!$A:$A,$B218,'00 Alimenta'!E:E)*-1)","v":0}]
["BC","BA1740","Altri servizi non sanitari da privato","C",{"$f":"IF('00 Aggregatore'!$D219=\"R\",SUMIF('00 Alimenta'!$A:$A,$B219,'00 Alimenta'!D:D),SUMIF('00 Alimenta'!$A:$A,$B219,'00 Alimenta'!D:D)*-1)","v":6734788.6000000006},{"$f":"IF('00 Aggregatore'!$D219=\"R\",SUMIF('00 Alimenta'!$A:$A,$B219,'00 Alimenta'!E:E),SUMIF('00 Alimenta'!$A:$A,$B219,'00 Alimenta'!E:E)*-1)","v":6621405.9100000001}]
["BC","BA1760","Consulenze non sanitarie da Aziende sanitarie pubbliche della Regione","C",{"$f":"IF('00 Aggregatore'!$D220=\"R\",SUMIF('00 Alimenta'!$A:$A,$B220,'00 Alimenta'!D:D),SUMIF('00 Alimenta'!$A:$A,$B220,'00 Alimenta'!D:D)*-1)","v":0},{"$f":"IF('00 Aggregatore'!$D220=\"R\",SUMIF('00 Alimenta'!$A:$A,$B220,'00 Alimenta'!E:E),SUMIF('00 Alimenta'!$A:$A,$B220,'00 Alimenta'!E:E)*-1)","v":0}]
["BC","BA1770","Consulenze non sanitarie da Terzi - Altri soggetti pubblici","C",{"$f":"IF('00 Aggregatore'!$D221=\"R\",SUMIF('00 Alimenta'!$A:$A,$B221,'00 Alimenta'!D:D),SUMIF('00 Alimenta'!$A:$A,$B221,'00 Alimenta'!D:D)*-1)","v":0},{"$f":"IF('00 Aggregatore'!$D221=\"R\",SUMIF('00 Alimenta'!$A:$A,$B221,'00 Alimenta'!E:E),SUMIF('00 Alimenta'!$A:$A,$B221,'00 Alimenta'!E:E)*-1)","v":0}]
["BC","BA1790","Consulenze non sanitarie da privato","C",{"$f":"IF('00 Aggregatore'!$D222=\"R\",SUMIF('00 Alimenta'!$A:$A,$B222,'00 Alimenta'!D:D),SUMIF('00 Alimenta'!$A:$A,$B222,'00 Alimenta'!D:D)*-1)","v":518707.44999999995},{"$f":"IF('00 Aggregatore'!$D222=\"R\",SUMIF('00 Alimenta'!$A:$A,$B222,'00 Alimenta'!E:E),SUMIF('00 Alimenta'!$A:$A,$B222,'00 Alimenta'!E:E)*-1)","v":432526.65}]
["BC","BA1800","Collaborazioni coordinate e continuative non sanitarie da privato","C",{"$f":"IF('00 Aggregatore'!$D223=\"R\",SUMIF('00 Alimenta'!$A:$A,$B223,'00 Alimenta'!D:D),SUMIF('00 Alimenta'!$A:$A,$B223,'00 Alimenta'!D:D)*-1)","v":13535.39},{"$f":"IF('00 Aggregatore'!$D223=\"R\",SUMIF('00 Alimenta'!$A:$A,$B223,'00 Alimenta'!E:E),SUMIF('00 Alimenta'!$A:$A,$B223,'00 Alimenta'!E:E)*-1)","v":31178.34}]
["BC","BA1810","Indennità a personale universitario - Area non sanitaria","C",{"$f":"IF('00 Aggregatore'!$D224=\"R\",SUMIF('00 Alimenta'!$A:$A,$B224,'00 Alimenta'!D:D),SUMIF('00 Alimenta'!$A:$A,$B224,'00 Alimenta'!D:D)*-1)","v":0},{"$f":"IF('00 Aggregatore'!$D224=\"R\",SUMIF('00 Alimenta'!$A:$A,$B224,'00 Alimenta'!E:E),SUMIF('00 Alimenta'!$A:$A,$B224,'00 Alimenta'!E:E)*-1)","v":0}]
["BC","BA1820","Lavoro interinale - Area non sanitaria","C",{"$f":"IF('00 Aggregatore'!$D225=\"R\",SUMIF('00 Alimenta'!$A:$A,$B225,'00 Alimenta'!D:D),SUMIF('00 Alimenta'!$A:$A,$B225,'00 Alimenta'!D:D)*-1)","v":0},{"$f":"IF('00 Aggregatore'!$D225=\"R\",SUMIF('00 Alimenta'!$A:$A,$B225,'00 Alimenta'!E:E),SUMIF('00 Alimenta'!$A:$A,$B225,'00 Alimenta'!E:E)*-1)","v":0}]
["BC","BA1830","Altre collaborazioni e prestazioni di lavoro - Area non sanitaria","C",{"$f":"IF('00 Aggregatore'!$D226=\"R\",SUMIF('00 Alimenta'!$A:$A,$B226,'00 Alimenta'!D:D),SUMIF('00 Alimenta'!$A:$A,$B226,'00 Alimenta'!D:D)*-1)","v":117382.06},{"$f":"IF('00 Aggregatore'!$D226=\"R\",SUMIF('00 Alimenta'!$A:$A,$B226,'00 Alimenta'!E:E),SUMIF('00 Alimenta'!$A:$A,$B226,'00 Alimenta'!E:E)*-1)","v":128297.41}]
["BC","BA1850","Rimborso oneri stipendiali personale non sanitario in comando da Aziende sanitarie pubbliche della Regione","C",{"$f":"IF('00 Aggregatore'!$D227=\"R\",SUMIF('00 Alimenta'!$A:$A,$B227,'00 Alimenta'!D:D),SUMIF('00 Alimenta'!$A:$A,$B227,'00 Alimenta'!D:D)*-1)","v":0},{"$f":"IF('00 Aggregatore'!$D227=\"R\",SUMIF('00 Alimenta'!$A:$A,$B227,'00 Alimenta'!E:E),SUMIF('00 Alimenta'!$A:$A,$B227,'00 Alimenta'!E:E)*-1)","v":0}]
["BC","BA1860","Rimborso oneri stipendiali personale non sanitario in comando da Regione, soggetti pubblici e da Università","C",{"$f":"IF('00 Aggregatore'!$D228=\"R\",SUMIF('00 Alimenta'!$A:$A,$B228,'00 Alimenta'!D:D),SUMIF('00 Alimenta'!$A:$A,$B228,'00 Alimenta'!D:D)*-1)","v":0},{"$f":"IF('00 Aggregatore'!$D228=\"R\",SUMIF('00 Alimenta'!$A:$A,$B228,'00 Alimenta'!E:E),SUMIF('00 Alimenta'!$A:$A,$B228,'00 Alimenta'!E:E)*-1)","v":0}]
["BC","BA1870","Rimborso oneri stipendiali personale non sanitario in comando da Aziende di altre Regioni (extra Regione)","C",{"$f":"IF('00 Aggregatore'!$D229=\"R\",SUMIF('00 Alimenta'!$A:$A,$B229,'00 Alimenta'!D:D),SUMIF('00 Alimenta'!$A:$A,$B229,'00 Alimenta'!D:D)*-1)","v":0},{"$f":"IF('00 Aggregatore'!$D229=\"R\",SUMIF('00 Alimenta'!$A:$A,$B229,'00 Alimenta'!E:E),SUMIF('00 Alimenta'!$A:$A,$B229,'00 Alimenta'!E:E)*-1)","v":0}]
["BC","BA1890","Formazione (esternalizzata e non) da pubblico","C",{"$f":"IF('00 Aggregatore'!$D230=\"R\",SUMIF('00 Alimenta'!$A:$A,$B230,'00 Alimenta'!D:D),SUMIF('00 Alimenta'!$A:$A,$B230,'00 Alimenta'!D:D)*-1)","v":81237.64},{"$f":"IF('00 Aggregatore'!$D230=\"R\",SUMIF('00 Alimenta'!$A:$A,$B230,'00 Alimenta'!E:E),SUMIF('00 Alimenta'!$A:$A,$B230,'00 Alimenta'!E:E)*-1)","v":35012.980000000003}]
["BC","BA1900","Formazione (esternalizzata e non) da privato","C",{"$f":"IF('00 Aggregatore'!$D231=\"R\",SUMIF('00 Alimenta'!$A:$A,$B231,'00 Alimenta'!D:D),SUMIF('00 Alimenta'!$A:$A,$B231,'00 Alimenta'!D:D)*-1)","v":516106.58},{"$f":"IF('00 Aggregatore'!$D231=\"R\",SUMIF('00 Alimenta'!$A:$A,$B231,'00 Alimenta'!E:E),SUMIF('00 Alimenta'!$A:$A,$B231,'00 Alimenta'!E:E)*-1)","v":626252.09}]
["BC","BA1920","Manutenzione e riparazione ai fabbricati e loro pertinenze","C",{"$f":"IF('00 Aggregatore'!$D232=\"R\",SUMIF('00 Alimenta'!$A:$A,$B232,'00 Alimenta'!D:D),SUMIF('00 Alimenta'!$A:$A,$B232,'00 Alimenta'!D:D)*-1)","v":9244877.5800000001},{"$f":"IF('00 Aggregatore'!$D232=\"R\",SUMIF('00 Alimenta'!$A:$A,$B232,'00 Alimenta'!E:E),SUMIF('00 Alimenta'!$A:$A,$B232,'00 Alimenta'!E:E)*-1)","v":8571730.1999999993}]
["BC","BA1930","Manutenzione e riparazione agli impianti e macchinari","C",{"$f":"IF('00 Aggregatore'!$D233=\"R\",SUMIF('00 Alimenta'!$A:$A,$B233,'00 Alimenta'!D:D),SUMIF('00 Alimenta'!$A:$A,$B233,'00 Alimenta'!D:D)*-1)","v":0},{"$f":"IF('00 Aggregatore'!$D233=\"R\",SUMIF('00 Alimenta'!$A:$A,$B233,'00 Alimenta'!E:E),SUMIF('00 Alimenta'!$A:$A,$B233,'00 Alimenta'!E:E)*-1)","v":0}]
["BC","BA1940","Manutenzione e riparazione alle attrezzature sanitarie e scientifiche","C",{"$f":"IF('00 Aggregatore'!$D234=\"R\",SUMIF('00 Alimenta'!$A:$A,$B234,'00 Alimenta'!D:D),SUMIF('00 Alimenta'!$A:$A,$B234,'00 Alimenta'!D:D)*-1)","v":5502395.79},{"$f":"IF('00 Aggregatore'!$D234=\"R\",SUMIF('00 Alimenta'!$A:$A,$B234,'00 Alimenta'!E:E),SUMIF('00 Alimenta'!$A:$A,$B234,'00 Alimenta'!E:E)*-1)","v":6129147.0499999998}]
["BC","BA1950","Manutenzione e riparazione ai mobili e arredi","C",{"$f":"IF('00 Aggregatore'!$D235=\"R\",SUMIF('00 Alimenta'!$A:$A,$B235,'00 Alimenta'!D:D),SUMIF('00 Alimenta'!$A:$A,$B235,'00 Alimenta'!D:D)*-1)","v":0},{"$f":"IF('00 Aggregatore'!$D235=\"R\",SUMIF('00 Alimenta'!$A:$A,$B235,'00 Alimenta'!E:E),SUMIF('00 Alimenta'!$A:$A,$B235,'00 Alimenta'!E:E)*-1)","v":0}]
["BC","BA1960","Manutenzione e riparazione agli automezzi","C",{"$f":"IF('00 Aggregatore'!$D236=\"R\",SUMIF('00 Alimenta'!$A:$A,$B236,'00 Alimenta'!D:D),SUMIF('00 Alimenta'!$A:$A,$B236,'00 Alimenta'!D:D)*-1)","v":109400.27},{"$f":"IF('00 Aggregatore'!$D236=\"R\",SUMIF('00 Alimenta'!$A:$A,$B236,'00 Alimenta'!E:E),SUMIF('00 Alimenta'!$A:$A,$B236,'00 Alimenta'!E:E)*-1)","v":125986.4}]
["BC","BA1970","Altre manutenzioni e riparazioni","C",{"$f":"IF('00 Aggregatore'!$D237=\"R\",SUMIF('00 Alimenta'!$A:$A,$B237,'00 Alimenta'!D:D),SUMIF('00 Alimenta'!$A:$A,$B237,'00 Alimenta'!D:D)*-1)","v":873012.59},{"$f":"IF('00 Aggregatore'!$D237=\"R\",SUMIF('00 Alimenta'!$A:$A,$B237,'00 Alimenta'!E:E),SUMIF('00 Alimenta'!$A:$A,$B237,'00 Alimenta'!E:E)*-1)","v":883986.33}]
["BC","BA1980","Manutenzioni e riparazioni da Aziende sanitarie pubbliche della Regione","C",{"$f":"IF('00 Aggregatore'!$D238=\"R\",SUMIF('00 Alimenta'!$A:$A,$B238,'00 Alimenta'!D:D),SUMIF('00 Alimenta'!$A:$A,$B238,'00 Alimenta'!D:D)*-1)","v":0},{"$f":"IF('00 Aggregatore'!$D238=\"R\",SUMIF('00 Alimenta'!$A:$A,$B238,'00 Alimenta'!E:E),SUMIF('00 Alimenta'!$A:$A,$B238,'00 Alimenta'!E:E)*-1)","v":0}]
["BC","BA2000","Fitti passivi","C",{"$f":"IF('00 Aggregatore'!$D239=\"R\",SUMIF('00 Alimenta'!$A:$A,$B239,'00 Alimenta'!D:D),SUMIF('00 Alimenta'!$A:$A,$B239,'00 Alimenta'!D:D)*-1)","v":1239352.47},{"$f":"IF('00 Aggregatore'!$D239=\"R\",SUMIF('00 Alimenta'!$A:$A,$B239,'00 Alimenta'!E:E),SUMIF('00 Alimenta'!$A:$A,$B239,'00 Alimenta'!E:E)*-1)","v":1330887.46}]
["BC","BA2020","Canoni di noleggio - Area sanitaria","C",{"$f":"IF('00 Aggregatore'!$D240=\"R\",SUMIF('00 Alimenta'!$A:$A,$B240,'00 Alimenta'!D:D),SUMIF('00 Alimenta'!$A:$A,$B240,'00 Alimenta'!D:D)*-1)","v":4790860.33},{"$f":"IF('00 Aggregatore'!$D240=\"R\",SUMIF('00 Alimenta'!$A:$A,$B240,'00 Alimenta'!E:E),SUMIF('00 Alimenta'!$A:$A,$B240,'00 Alimenta'!E:E)*-1)","v":5015627.3600000003}]
["BC","BA2030","Canoni di noleggio - Area non sanitaria","C",{"$f":"IF('00 Aggregatore'!$D241=\"R\",SUMIF('00 Alimenta'!$A:$A,$B241,'00 Alimenta'!D:D),SUMIF('00 Alimenta'!$A:$A,$B241,'00 Alimenta'!D:D)*-1)","v":462059.44},{"$f":"IF('00 Aggregatore'!$D241=\"R\",SUMIF('00 Alimenta'!$A:$A,$B241,'00 Alimenta'!E:E),SUMIF('00 Alimenta'!$A:$A,$B241,'00 Alimenta'!E:E)*-1)","v":429967.97}]
["BC","BA2050","Canoni di leasing - Area sanitaria","C",{"$f":"IF('00 Aggregatore'!$D242=\"R\",SUMIF('00 Alimenta'!$A:$A,$B242,'00 Alimenta'!D:D),SUMIF('00 Alimenta'!$A:$A,$B242,'00 Alimenta'!D:D)*-1)","v":0},{"$f":"IF('00 Aggregatore'!$D242=\"R\",SUMIF('00 Alimenta'!$A:$A,$B242,'00 Alimenta'!E:E),SUMIF('00 Alimenta'!$A:$A,$B242,'00 Alimenta'!E:E)*-1)","v":0}]
["BC","BA2060","Canoni di leasing - Area non sanitaria","C",{"$f":"IF('00 Aggregatore'!$D243=\"R\",SUMIF('00 Alimenta'!$A:$A,$B243,'00 Alimenta'!D:D),SUMIF('00 Alimenta'!$A:$A,$B243,'00 Alimenta'!D:D)*-1)","v":0},{"$f":"IF('00 Aggregatore'!$D243=\"R\",SUMIF('00 Alimenta'!$A:$A,$B243,'00 Alimenta'!E:E),SUMIF('00 Alimenta'!$A:$A,$B243,'00 Alimenta'!E:E)*-1)","v":0}]
["BC","BA2070","Locazioni e noleggi da Aziende sanitarie pubbliche della Regione","C",{"$f":"IF('00 Aggregatore'!$D244=\"R\",SUMIF('00 Alimenta'!$A:$A,$B244,'00 Alimenta'!D:D),SUMIF('00 Alimenta'!$A:$A,$B244,'00 Alimenta'!D:D)*-1)","v":0},{"$f":"IF('00 Aggregatore'!$D244=\"R\",SUMIF('00 Alimenta'!$A:$A,$B244,'00 Alimenta'!E:E),SUMIF('00 Alimenta'!$A:$A,$B244,'00 Alimenta'!E:E)*-1)","v":0}]
["BC","BA2120","Costo del personale dirigente medico - Tempo indeterminato","C",{"$f":"IF('00 Aggregatore'!$D245=\"R\",SUMIF('00 Alimenta'!$A:$A,$B245,'00 Alimenta'!D:D),SUMIF('00 Alimenta'!$A:$A,$B245,'00 Alimenta'!D:D)*-1)","v":66243178.869999997},{"$f":"IF('00 Aggregatore'!$D245=\"R\",SUMIF('00 Alimenta'!$A:$A,$B245,'00 Alimenta'!E:E),SUMIF('00 Alimenta'!$A:$A,$B245,'00 Alimenta'!E:E)*-1)","v":64319241.780000001}]
["BC","BA2130","Costo del personale dirigente medico - Tempo determinato","C",{"$f":"IF('00 Aggregatore'!$D246=\"R\",SUMIF('00 Alimenta'!$A:$A,$B246,'00 Alimenta'!D:D),SUMIF('00 Alimenta'!$A:$A,$B246,'00 Alimenta'!D:D)*-1)","v":1905680.32},{"$f":"IF('00 Aggregatore'!$D246=\"R\",SUMIF('00 Alimenta'!$A:$A,$B246,'00 Alimenta'!E:E),SUMIF('00 Alimenta'!$A:$A,$B246,'00 Alimenta'!E:E)*-1)","v":3032628.94}]
["BC","BA2140","Costo del personale dirigente medico - Altro","C",{"$f":"IF('00 Aggregatore'!$D247=\"R\",SUMIF('00 Alimenta'!$A:$A,$B247,'00 Alimenta'!D:D),SUMIF('00 Alimenta'!$A:$A,$B247,'00 Alimenta'!D:D)*-1)","v":0},{"$f":"IF('00 Aggregatore'!$D247=\"R\",SUMIF('00 Alimenta'!$A:$A,$B247,'00 Alimenta'!E:E),SUMIF('00 Alimenta'!$A:$A,$B247,'00 Alimenta'!E:E)*-1)","v":0}]
["BC","BA2160","Costo del personale dirigente non medico - Tempo indeterminato","C",{"$f":"IF('00 Aggregatore'!$D248=\"R\",SUMIF('00 Alimenta'!$A:$A,$B248,'00 Alimenta'!D:D),SUMIF('00 Alimenta'!$A:$A,$B248,'00 Alimenta'!D:D)*-1)","v":5064518.01},{"$f":"IF('00 Aggregatore'!$D248=\"R\",SUMIF('00 Alimenta'!$A:$A,$B248,'00 Alimenta'!E:E),SUMIF('00 Alimenta'!$A:$A,$B248,'00 Alimenta'!E:E)*-1)","v":4831272.49}]
["BC","BA2170","Costo del personale dirigente non medico - Tempo determinato","C",{"$f":"IF('00 Aggregatore'!$D249=\"R\",SUMIF('00 Alimenta'!$A:$A,$B249,'00 Alimenta'!D:D),SUMIF('00 Alimenta'!$A:$A,$B249,'00 Alimenta'!D:D)*-1)","v":104896.52000000002},{"$f":"IF('00 Aggregatore'!$D249=\"R\",SUMIF('00 Alimenta'!$A:$A,$B249,'00 Alimenta'!E:E),SUMIF('00 Alimenta'!$A:$A,$B249,'00 Alimenta'!E:E)*-1)","v":388279.68}]
["BC","BA2180","Costo del personale dirigente non medico - Altro","C",{"$f":"IF('00 Aggregatore'!$D250=\"R\",SUMIF('00 Alimenta'!$A:$A,$B250,'00 Alimenta'!D:D),SUMIF('00 Alimenta'!$A:$A,$B250,'00 Alimenta'!D:D)*-1)","v":0},{"$f":"IF('00 Aggregatore'!$D250=\"R\",SUMIF('00 Alimenta'!$A:$A,$B250,'00 Alimenta'!E:E),SUMIF('00 Alimenta'!$A:$A,$B250,'00 Alimenta'!E:E)*-1)","v":0}]
["BC","BA2200","Costo del personale comparto ruolo sanitario - Tempo indeterminato","C",{"$f":"IF('00 Aggregatore'!$D251=\"R\",SUMIF('00 Alimenta'!$A:$A,$B251,'00 Alimenta'!D:D),SUMIF('00 Alimenta'!$A:$A,$B251,'00 Alimenta'!D:D)*-1)","v":64044509.309999995},{"$f":"IF('00 Aggregatore'!$D251=\"R\",SUMIF('00 Alimenta'!$A:$A,$B251,'00 Alimenta'!E:E),SUMIF('00 Alimenta'!$A:$A,$B251,'00 Alimenta'!E:E)*-1)","v":65514162.510000005}]
["BC","BA2210","Costo del personale comparto ruolo sanitario - Tempo determinato","C",{"$f":"IF('00 Aggregatore'!$D252=\"R\",SUMIF('00 Alimenta'!$A:$A,$B252,'00 Alimenta'!D:D),SUMIF('00 Alimenta'!$A:$A,$B252,'00 Alimenta'!D:D)*-1)","v":812435.66},{"$f":"IF('00 Aggregatore'!$D252=\"R\",SUMIF('00 Alimenta'!$A:$A,$B252,'00 Alimenta'!E:E),SUMIF('00 Alimenta'!$A:$A,$B252,'00 Alimenta'!E:E)*-1)","v":1734965.7400000002}]
["BC","BA2220","Costo del personale comparto ruolo sanitario - Altro","C",{"$f":"IF('00 Aggregatore'!$D253=\"R\",SUMIF('00 Alimenta'!$A:$A,$B253,'00 Alimenta'!D:D),SUMIF('00 Alimenta'!$A:$A,$B253,'00 Alimenta'!D:D)*-1)","v":0},{"$f":"IF('00 Aggregatore'!$D253=\"R\",SUMIF('00 Alimenta'!$A:$A,$B253,'00 Alimenta'!E:E),SUMIF('00 Alimenta'!$A:$A,$B253,'00 Alimenta'!E:E)*-1)","v":0}]
["BC","BA2250","Costo del personale dirigente ruolo professionale - Tempo indeterminato","C",{"$f":"IF('00 Aggregatore'!$D254=\"R\",SUMIF('00 Alimenta'!$A:$A,$B254,'00 Alimenta'!D:D),SUMIF('00 Alimenta'!$A:$A,$B254,'00 Alimenta'!D:D)*-1)","v":404674.32},{"$f":"IF('00 Aggregatore'!$D254=\"R\",SUMIF('00 Alimenta'!$A:$A,$B254,'00 Alimenta'!E:E),SUMIF('00 Alimenta'!$A:$A,$B254,'00 Alimenta'!E:E)*-1)","v":367654.11}]
["BC","BA2260","Costo del personale dirigente ruolo professionale - Tempo determinato","C",{"$f":"IF('00 Aggregatore'!$D255=\"R\",SUMIF('00 Alimenta'!$A:$A,$B255,'00 Alimenta'!D:D),SUMIF('00 Alimenta'!$A:$A,$B255,'00 Alimenta'!D:D)*-1)","v":21123.85},{"$f":"IF('00 Aggregatore'!$D255=\"R\",SUMIF('00 Alimenta'!$A:$A,$B255,'00 Alimenta'!E:E),SUMIF('00 Alimenta'!$A:$A,$B255,'00 Alimenta'!E:E)*-1)","v":69627.22}]
["BC","BA2270","Costo del personale dirigente ruolo professionale - Altro","C",{"$f":"IF('00 Aggregatore'!$D256=\"R\",SUMIF('00 Alimenta'!$A:$A,$B256,'00 Alimenta'!D:D),SUMIF('00 Alimenta'!$A:$A,$B256,'00 Alimenta'!D:D)*-1)","v":0},{"$f":"IF('00 Aggregatore'!$D256=\"R\",SUMIF('00 Alimenta'!$A:$A,$B256,'00 Alimenta'!E:E),SUMIF('00 Alimenta'!$A:$A,$B256,'00 Alimenta'!E:E)*-1)","v":0}]
["BC","BA2290","Costo del personale comparto ruolo professionale - Tempo indeterminato","C",{"$f":"IF('00 Aggregatore'!$D257=\"R\",SUMIF('00 Alimenta'!$A:$A,$B257,'00 Alimenta'!D:D),SUMIF('00 Alimenta'!$A:$A,$B257,'00 Alimenta'!D:D)*-1)","v":12403.57},{"$f":"IF('00 Aggregatore'!$D257=\"R\",SUMIF('00 Alimenta'!$A:$A,$B257,'00 Alimenta'!E:E),SUMIF('00 Alimenta'!$A:$A,$B257,'00 Alimenta'!E:E)*-1)","v":1579.73}]
["BC","BA2300","Costo del personale comparto ruolo professionale - Tempo determinato","C",{"$f":"IF('00 Aggregatore'!$D258=\"R\",SUMIF('00 Alimenta'!$A:$A,$B258,'00 Alimenta'!D:D),SUMIF('00 Alimenta'!$A:$A,$B258,'00 Alimenta'!D:D)*-1)","v":0},{"$f":"IF('00 Aggregatore'!$D258=\"R\",SUMIF('00 Alimenta'!$A:$A,$B258,'00 Alimenta'!E:E),SUMIF('00 Alimenta'!$A:$A,$B258,'00 Alimenta'!E:E)*-1)","v":0}]
["BC","BA2310","Costo del personale comparto ruolo professionale - Altro","C",{"$f":"IF('00 Aggregatore'!$D259=\"R\",SUMIF('00 Alimenta'!$A:$A,$B259,'00 Alimenta'!D:D),SUMIF('00 Alimenta'!$A:$A,$B259,'00 Alimenta'!D:D)*-1)","v":0},{"$f":"IF('00 Aggregatore'!$D259=\"R\",SUMIF('00 Alimenta'!$A:$A,$B259,'00 Alimenta'!E:E),SUMIF('00 Alimenta'!$A:$A,$B259,'00 Alimenta'!E:E)*-1)","v":0}]
["BC","BA2340","Costo del personale dirigente ruolo tecnico - Tempo indeterminato","C",{"$f":"IF('00 Aggregatore'!$D260=\"R\",SUMIF('00 Alimenta'!$A:$A,$B260,'00 Alimenta'!D:D),SUMIF('00 Alimenta'!$A:$A,$B260,'00 Alimenta'!D:D)*-1)","v":375739.52999999997},{"$f":"IF('00 Aggregatore'!$D260=\"R\",SUMIF('00 Alimenta'!$A:$A,$B260,'00 Alimenta'!E:E),SUMIF('00 Alimenta'!$A:$A,$B260,'00 Alimenta'!E:E)*-1)","v":345702.9}]
["BC","BA2350","Costo del personale dirigente ruolo tecnico - Tempo determinato","C",{"$f":"IF('00 Aggregatore'!$D261=\"R\",SUMIF('00 Alimenta'!$A:$A,$B261,'00 Alimenta'!D:D),SUMIF('00 Alimenta'!$A:$A,$B261,'00 Alimenta'!D:D)*-1)","v":0},{"$f":"IF('00 Aggregatore'!$D261=\"R\",SUMIF('00 Alimenta'!$A:$A,$B261,'00 Alimenta'!E:E),SUMIF('00 Alimenta'!$A:$A,$B261,'00 Alimenta'!E:E)*-1)","v":0}]
[{"$f":"LEFT(B262,1)&D262","v":"BC"},"BA2360","Costo del personale dirigente ruolo tecnico - Altro","C",{"$f":"IF('00 Aggregatore'!$D262=\"R\",SUMIF('00 Alimenta'!$A:$A,$B262,'00 Alimenta'!D:D),SUMIF('00 Alimenta'!$A:$A,$B262,'00 Alimenta'!D:D)*-1)","v":0},{"$f":"IF('00 Aggregatore'!$D262=\"R\",SUMIF('00 Alimenta'!$A:$A,$B262,'00 Alimenta'!E:E),SUMIF('00 Alimenta'!$A:$A,$B262,'00 Alimenta'!E:E)*-1)","v":0}]
["BC","BA2380","Costo del personale comparto ruolo tecnico - Tempo indeterminato","C",{"$f":"IF('00 Aggregatore'!$D263=\"R\",SUMIF('00 Alimenta'!$A:$A,$B263,'00 Alimenta'!D:D),SUMIF('00 Alimenta'!$A:$A,$B263,'00 Alimenta'!D:D)*-1)","v":15963506.970000001},{"$f":"IF('00 Aggregatore'!$D263=\"R\",SUMIF('00 Alimenta'!$A:$A,$B263,'00 Alimenta'!E:E),SUMIF('00 Alimenta'!$A:$A,$B263,'00 Alimenta'!E:E)*-1)","v":16881837.510000002}]
["BC","BA2390","Costo del personale comparto ruolo tecnico - Tempo determinato","C",{"$f":"IF('00 Aggregatore'!$D264=\"R\",SUMIF('00 Alimenta'!$A:$A,$B264,'00 Alimenta'!D:D),SUMIF('00 Alimenta'!$A:$A,$B264,'00 Alimenta'!D:D)*-1)","v":177223.65000000002},{"$f":"IF('00 Aggregatore'!$D264=\"R\",SUMIF('00 Alimenta'!$A:$A,$B264,'00 Alimenta'!E:E),SUMIF('00 Alimenta'!$A:$A,$B264,'00 Alimenta'!E:E)*-1)","v":291302.39999999997}]
["BC","BA2400","Costo del personale comparto ruolo tecnico - Altro","C",{"$f":"IF('00 Aggregatore'!$D265=\"R\",SUMIF('00 Alimenta'!$A:$A,$B265,'00 Alimenta'!D:D),SUMIF('00 Alimenta'!$A:$A,$B265,'00 Alimenta'!D:D)*-1)","v":0},{"$f":"IF('00 Aggregatore'!$D265=\"R\",SUMIF('00 Alimenta'!$A:$A,$B265,'00 Alimenta'!E:E),SUMIF('00 Alimenta'!$A:$A,$B265,'00 Alimenta'!E:E)*-1)","v":0}]
["BC","BA2430","Costo del personale dirigente ruolo amministrativo - Tempo indeterminato","C",{"$f":"IF('00 Aggregatore'!$D266=\"R\",SUMIF('00 Alimenta'!$A:$A,$B266,'00 Alimenta'!D:D),SUMIF('00 Alimenta'!$A:$A,$B266,'00 Alimenta'!D:D)*-1)","v":824224.55},{"$f":"IF('00 Aggregatore'!$D266=\"R\",SUMIF('00 Alimenta'!$A:$A,$B266,'00 Alimenta'!E:E),SUMIF('00 Alimenta'!$A:$A,$B266,'00 Alimenta'!E:E)*-1)","v":922464.95}]
["BC","BA2440","Costo del personale dirigente ruolo amministrativo - Tempo determinato","C",{"$f":"IF('00 Aggregatore'!$D267=\"R\",SUMIF('00 Alimenta'!$A:$A,$B267,'00 Alimenta'!D:D),SUMIF('00 Alimenta'!$A:$A,$B267,'00 Alimenta'!D:D)*-1)","v":0},{"$f":"IF('00 Aggregatore'!$D267=\"R\",SUMIF('00 Alimenta'!$A:$A,$B267,'00 Alimenta'!E:E),SUMIF('00 Alimenta'!$A:$A,$B267,'00 Alimenta'!E:E)*-1)","v":15595.28}]
["BC","BA2450","Costo del personale dirigente ruolo amministrativo - Altro","C",{"$f":"IF('00 Aggregatore'!$D268=\"R\",SUMIF('00 Alimenta'!$A:$A,$B268,'00 Alimenta'!D:D),SUMIF('00 Alimenta'!$A:$A,$B268,'00 Alimenta'!D:D)*-1)","v":0},{"$f":"IF('00 Aggregatore'!$D268=\"R\",SUMIF('00 Alimenta'!$A:$A,$B268,'00 Alimenta'!E:E),SUMIF('00 Alimenta'!$A:$A,$B268,'00 Alimenta'!E:E)*-1)","v":0}]
["BC","BA2470","Costo del personale comparto ruolo amministrativo - Tempo indeterminato","C",{"$f":"IF('00 Aggregatore'!$D269=\"R\",SUMIF('00 Alimenta'!$A:$A,$B269,'00 Alimenta'!D:D),SUMIF('00 Alimenta'!$A:$A,$B269,'00 Alimenta'!D:D)*-1)","v":9288718.9999999981},{"$f":"IF('00 Aggregatore'!$D269=\"R\",SUMIF('00 Alimenta'!$A:$A,$B269,'00 Alimenta'!E:E),SUMIF('00 Alimenta'!$A:$A,$B269,'00 Alimenta'!E:E)*-1)","v":9121759.0600000005}]
["BC","BA2480","Costo del personale comparto ruolo amministrativo - Tempo determinato","C",{"$f":"IF('00 Aggregatore'!$D270=\"R\",SUMIF('00 Alimenta'!$A:$A,$B270,'00 Alimenta'!D:D),SUMIF('00 Alimenta'!$A:$A,$B270,'00 Alimenta'!D:D)*-1)","v":1368.31},{"$f":"IF('00 Aggregatore'!$D270=\"R\",SUMIF('00 Alimenta'!$A:$A,$B270,'00 Alimenta'!E:E),SUMIF('00 Alimenta'!$A:$A,$B270,'00 Alimenta'!E:E)*-1)","v":37487.29}]
["BC","BA2490","Costo del personale comparto ruolo amministrativo - Altro","C",{"$f":"IF('00 Aggregatore'!$D271=\"R\",SUMIF('00 Alimenta'!$A:$A,$B271,'00 Alimenta'!D:D),SUMIF('00 Alimenta'!$A:$A,$B271,'00 Alimenta'!D:D)*-1)","v":0},{"$f":"IF('00 Aggregatore'!$D271=\"R\",SUMIF('00 Alimenta'!$A:$A,$B271,'00 Alimenta'!E:E),SUMIF('00 Alimenta'!$A:$A,$B271,'00 Alimenta'!E:E)*-1)","v":0}]
["BC","BA2510","Imposte e tasse (escluso IRAP e IRES)","C",{"$f":"IF('00 Aggregatore'!$D272=\"R\",SUMIF('00 Alimenta'!$A:$A,$B272,'00 Alimenta'!D:D),SUMIF('00 Alimenta'!$A:$A,$B272,'00 Alimenta'!D:D)*-1)","v":1160574.8},{"$f":"IF('00 Aggregatore'!$D272=\"R\",SUMIF('00 Alimenta'!$A:$A,$B272,'00 Alimenta'!E:E),SUMIF('00 Alimenta'!$A:$A,$B272,'00 Alimenta'!E:E)*-1)","v":1247157.1599999999}]
["BC","BA2520","Perdite su crediti","C",{"$f":"IF('00 Aggregatore'!$D273=\"R\",SUMIF('00 Alimenta'!$A:$A,$B273,'00 Alimenta'!D:D),SUMIF('00 Alimenta'!$A:$A,$B273,'00 Alimenta'!D:D)*-1)","v":0},{"$f":"IF('00 Aggregatore'!$D273=\"R\",SUMIF('00 Alimenta'!$A:$A,$B273,'00 Alimenta'!E:E),SUMIF('00 Alimenta'!$A:$A,$B273,'00 Alimenta'!E:E)*-1)","v":0}]
["BC","BA2540","Indennità, rimborso spese e oneri sociali per gli Organi Direttivi e Collegio Sindacale","C",{"$f":"IF('00 Aggregatore'!$D274=\"R\",SUMIF('00 Alimenta'!$A:$A,$B274,'00 Alimenta'!D:D),SUMIF('00 Alimenta'!$A:$A,$B274,'00 Alimenta'!D:D)*-1)","v":1430687.1400000001},{"$f":"IF('00 Aggregatore'!$D274=\"R\",SUMIF('00 Alimenta'!$A:$A,$B274,'00 Alimenta'!E:E),SUMIF('00 Alimenta'!$A:$A,$B274,'00 Alimenta'!E:E)*-1)","v":1338906.02}]
["BC","BA2550","Altri oneri diversi di gestione","C",{"$f":"IF('00 Aggregatore'!$D275=\"R\",SUMIF('00 Alimenta'!$A:$A,$B275,'00 Alimenta'!D:D),SUMIF('00 Alimenta'!$A:$A,$B275,'00 Alimenta'!D:D)*-1)","v":292884.42000000004},{"$f":"IF('00 Aggregatore'!$D275=\"R\",SUMIF('00 Alimenta'!$A:$A,$B275,'00 Alimenta'!E:E),SUMIF('00 Alimenta'!$A:$A,$B275,'00 Alimenta'!E:E)*-1)","v":251935.31999999998}]
["BC","BA2570","Ammortamenti delle immobilizzazioni immateriali","C",{"$f":"IF('00 Aggregatore'!$D276=\"R\",SUMIF('00 Alimenta'!$A:$A,$B276,'00 Alimenta'!D:D),SUMIF('00 Alimenta'!$A:$A,$B276,'00 Alimenta'!D:D)*-1)","v":136552.39000000001},{"$f":"IF('00 Aggregatore'!$D276=\"R\",SUMIF('00 Alimenta'!$A:$A,$B276,'00 Alimenta'!E:E),SUMIF('00 Alimenta'!$A:$A,$B276,'00 Alimenta'!E:E)*-1)","v":160938.81}]
["BC","BA2600","Ammortamenti fabbricati non strumentali (disponibili)","C",{"$f":"IF('00 Aggregatore'!$D277=\"R\",SUMIF('00 Alimenta'!$A:$A,$B277,'00 Alimenta'!D:D),SUMIF('00 Alimenta'!$A:$A,$B277,'00 Alimenta'!D:D)*-1)","v":0},{"$f":"IF('00 Aggregatore'!$D277=\"R\",SUMIF('00 Alimenta'!$A:$A,$B277,'00 Alimenta'!E:E),SUMIF('00 Alimenta'!$A:$A,$B277,'00 Alimenta'!E:E)*-1)","v":0}]
["BC","BA2610","Ammortamenti fabbricati strumentali (indisponibili)","C",{"$f":"IF('00 Aggregatore'!$D278=\"R\",SUMIF('00 Alimenta'!$A:$A,$B278,'00 Alimenta'!D:D),SUMIF('00 Alimenta'!$A:$A,$B278,'00 Alimenta'!D:D)*-1)","v":4970287.05},{"$f":"IF('00 Aggregatore'!$D278=\"R\",SUMIF('00 Alimenta'!$A:$A,$B278,'00 Alimenta'!E:E),SUMIF('00 Alimenta'!$A:$A,$B278,'00 Alimenta'!E:E)*-1)","v":4970458.6100000003}]
["BC","BA2620","Ammortamento dei fabbricati","C",{"$f":"IF('00 Aggregatore'!$D279=\"R\",SUMIF('00 Alimenta'!$A:$A,$B279,'00 Alimenta'!D:D),SUMIF('00 Alimenta'!$A:$A,$B279,'00 Alimenta'!D:D)*-1)","v":5155538.32},{"$f":"IF('00 Aggregatore'!$D279=\"R\",SUMIF('00 Alimenta'!$A:$A,$B279,'00 Alimenta'!E:E),SUMIF('00 Alimenta'!$A:$A,$B279,'00 Alimenta'!E:E)*-1)","v":5750040.4199999999}]
["BC","BA2640","Svalutazione delle immobilizzazioni immateriali e materiali","C",{"$f":"IF('00 Aggregatore'!$D280=\"R\",SUMIF('00 Alimenta'!$A:$A,$B280,'00 Alimenta'!D:D),SUMIF('00 Alimenta'!$A:$A,$B280,'00 Alimenta'!D:D)*-1)","v":0},{"$f":"IF('00 Aggregatore'!$D280=\"R\",SUMIF('00 Alimenta'!$A:$A,$B280,'00 Alimenta'!E:E),SUMIF('00 Alimenta'!$A:$A,$B280,'00 Alimenta'!E:E)*-1)","v":0}]
["BC","BA2650","Svalutazione dei crediti","C",{"$f":"IF('00 Aggregatore'!$D281=\"R\",SUMIF('00 Alimenta'!$A:$A,$B281,'00 Alimenta'!D:D),SUMIF('00 Alimenta'!$A:$A,$B281,'00 Alimenta'!D:D)*-1)","v":0},{"$f":"IF('00 Aggregatore'!$D281=\"R\",SUMIF('00 Alimenta'!$A:$A,$B281,'00 Alimenta'!E:E),SUMIF('00 Alimenta'!$A:$A,$B281,'00 Alimenta'!E:E)*-1)","v":0}]
["BC","BA2670","Variazione rimanenze sanitarie","C",{"$f":"IF('00 Aggregatore'!$D282=\"R\",SUMIF('00 Alimenta'!$A:$A,$B282,'00 Alimenta'!D:D),SUMIF('00 Alimenta'!$A:$A,$B282,'00 Alimenta'!D:D)*-1)","v":-1167703.8400000005},{"$f":"IF('00 Aggregatore'!$D282=\"R\",SUMIF('00 Alimenta'!$A:$A,$B282,'00 Alimenta'!E:E),SUMIF('00 Alimenta'!$A:$A,$B282,'00 Alimenta'!E:E)*-1)","v":-5123500.2699999996}]
["BC","BA2680","Variazione rimanenze non sanitarie","C",{"$f":"IF('00 Aggregatore'!$D283=\"R\",SUMIF('00 Alimenta'!$A:$A,$B283,'00 Alimenta'!D:D),SUMIF('00 Alimenta'!$A:$A,$B283,'00 Alimenta'!D:D)*-1)","v":-54390.610000000037},{"$f":"IF('00 Aggregatore'!$D283=\"R\",SUMIF('00 Alimenta'!$A:$A,$B283,'00 Alimenta'!E:E),SUMIF('00 Alimenta'!$A:$A,$B283,'00 Alimenta'!E:E)*-1)","v":112498.70999999998}]
["BC","BA2710","Accantonamenti per cause civili e oneri processuali","C",{"$f":"IF('00 Aggregatore'!$D284=\"R\",SUMIF('00 Alimenta'!$A:$A,$B284,'00 Alimenta'!D:D),SUMIF('00 Alimenta'!$A:$A,$B284,'00 Alimenta'!D:D)*-1)","v":9268206.2400000002},{"$f":"IF('00 Aggregatore'!$D284=\"R\",SUMIF('00 Alimenta'!$A:$A,$B284,'00 Alimenta'!E:E),SUMIF('00 Alimenta'!$A:$A,$B284,'00 Alimenta'!E:E)*-1)","v":1357811.38}]
["BC","BA2720","Accantonamenti per contenzioso personale dipendente","C",{"$f":"IF('00 Aggregatore'!$D285=\"R\",SUMIF('00 Alimenta'!$A:$A,$B285,'00 Alimenta'!D:D),SUMIF('00 Alimenta'!$A:$A,$B285,'00 Alimenta'!D:D)*-1)","v":562892.11},{"$f":"IF('00 Aggregatore'!$D285=\"R\",SUMIF('00 Alimenta'!$A:$A,$B285,'00 Alimenta'!E:E),SUMIF('00 Alimenta'!$A:$A,$B285,'00 Alimenta'!E:E)*-1)","v":0}]
["BC","BA2730","Accantonamenti per rischi connessi all'acquisto di prestazioni sanitarie da privato","C",{"$f":"IF('00 Aggregatore'!$D286=\"R\",SUMIF('00 Alimenta'!$A:$A,$B286,'00 Alimenta'!D:D),SUMIF('00 Alimenta'!$A:$A,$B286,'00 Alimenta'!D:D)*-1)","v":4358962},{"$f":"IF('00 Aggregatore'!$D286=\"R\",SUMIF('00 Alimenta'!$A:$A,$B286,'00 Alimenta'!E:E),SUMIF('00 Alimenta'!$A:$A,$B286,'00 Alimenta'!E:E)*-1)","v":272176.8}]
["BC","BA2740","Accantonamenti per copertura diretta dei rischi (autoassicurazione)","C",{"$f":"IF('00 Aggregatore'!$D287=\"R\",SUMIF('00 Alimenta'!$A:$A,$B287,'00 Alimenta'!D:D),SUMIF('00 Alimenta'!$A:$A,$B287,'00 Alimenta'!D:D)*-1)","v":3111381.31},{"$f":"IF('00 Aggregatore'!$D287=\"R\",SUMIF('00 Alimenta'!$A:$A,$B287,'00 Alimenta'!E:E),SUMIF('00 Alimenta'!$A:$A,$B287,'00 Alimenta'!E:E)*-1)","v":2297725.7799999998}]
["BC","BA2750","Altri accantonamenti per rischi","C",{"$f":"IF('00 Aggregatore'!$D288=\"R\",SUMIF('00 Alimenta'!$A:$A,$B288,'00 Alimenta'!D:D),SUMIF('00 Alimenta'!$A:$A,$B288,'00 Alimenta'!D:D)*-1)","v":0},{"$f":"IF('00 Aggregatore'!$D288=\"R\",SUMIF('00 Alimenta'!$A:$A,$B288,'00 Alimenta'!E:E),SUMIF('00 Alimenta'!$A:$A,$B288,'00 Alimenta'!E:E)*-1)","v":0}]
["BC","BA2760","Accantonamenti per premio di operosità (SUMAI)","C",{"$f":"IF('00 Aggregatore'!$D289=\"R\",SUMIF('00 Alimenta'!$A:$A,$B289,'00 Alimenta'!D:D),SUMIF('00 Alimenta'!$A:$A,$B289,'00 Alimenta'!D:D)*-1)","v":223015.56},{"$f":"IF('00 Aggregatore'!$D289=\"R\",SUMIF('00 Alimenta'!$A:$A,$B289,'00 Alimenta'!E:E),SUMIF('00 Alimenta'!$A:$A,$B289,'00 Alimenta'!E:E)*-1)","v":264664.11}]
["BC","BA2780","Accantonamenti per quote inutilizzate contributi da Regione o Provincia Autonoma per quota F.S. vincolato","C",{"$f":"IF('00 Aggregatore'!$D290=\"R\",SUMIF('00 Alimenta'!$A:$A,$B290,'00 Alimenta'!D:D),SUMIF('00 Alimenta'!$A:$A,$B290,'00 Alimenta'!D:D)*-1)","v":7018127.5499999998},{"$f":"IF('00 Aggregatore'!$D290=\"R\",SUMIF('00 Alimenta'!$A:$A,$B290,'00 Alimenta'!E:E),SUMIF('00 Alimenta'!$A:$A,$B290,'00 Alimenta'!E:E)*-1)","v":7216729.6299999999}]
["BC","BA2790","Accantonamenti per quote inutilizzate contributi da soggetti pubblici (extra fondo) vincolati","C",{"$f":"IF('00 Aggregatore'!$D291=\"R\",SUMIF('00 Alimenta'!$A:$A,$B291,'00 Alimenta'!D:D),SUMIF('00 Alimenta'!$A:$A,$B291,'00 Alimenta'!D:D)*-1)","v":50302.400000000001},{"$f":"IF('00 Aggregatore'!$D291=\"R\",SUMIF('00 Alimenta'!$A:$A,$B291,'00 Alimenta'!E:E),SUMIF('00 Alimenta'!$A:$A,$B291,'00 Alimenta'!E:E)*-1)","v":53105.86}]
["BC","BA2800","Accantonamenti per quote inutilizzate contributi da soggetti pubblici per ricerca","C",{"$f":"IF('00 Aggregatore'!$D292=\"R\",SUMIF('00 Alimenta'!$A:$A,$B292,'00 Alimenta'!D:D),SUMIF('00 Alimenta'!$A:$A,$B292,'00 Alimenta'!D:D)*-1)","v":0},{"$f":"IF('00 Aggregatore'!$D292=\"R\",SUMIF('00 Alimenta'!$A:$A,$B292,'00 Alimenta'!E:E),SUMIF('00 Alimenta'!$A:$A,$B292,'00 Alimenta'!E:E)*-1)","v":0}]
["BC","BA2810","Accantonamenti per quote inutilizzate contributi vincolati da privati","C",{"$f":"IF('00 Aggregatore'!$D293=\"R\",SUMIF('00 Alimenta'!$A:$A,$B293,'00 Alimenta'!D:D),SUMIF('00 Alimenta'!$A:$A,$B293,'00 Alimenta'!D:D)*-1)","v":0},{"$f":"IF('00 Aggregatore'!$D293=\"R\",SUMIF('00 Alimenta'!$A:$A,$B293,'00 Alimenta'!E:E),SUMIF('00 Alimenta'!$A:$A,$B293,'00 Alimenta'!E:E)*-1)","v":0}]
["BC","BA2830","Accantonamenti per interessi di mora","C",{"$f":"IF('00 Aggregatore'!$D294=\"R\",SUMIF('00 Alimenta'!$A:$A,$B294,'00 Alimenta'!D:D),SUMIF('00 Alimenta'!$A:$A,$B294,'00 Alimenta'!D:D)*-1)","v":0},{"$f":"IF('00 Aggregatore'!$D294=\"R\",SUMIF('00 Alimenta'!$A:$A,$B294,'00 Alimenta'!E:E),SUMIF('00 Alimenta'!$A:$A,$B294,'00 Alimenta'!E:E)*-1)","v":0}]
["BC","BA2840","Accantonamenti per rinnovi convenzioni MMG/PLS/MCA","C",{"$f":"IF('00 Aggregatore'!$D295=\"R\",SUMIF('00 Alimenta'!$A:$A,$B295,'00 Alimenta'!D:D),SUMIF('00 Alimenta'!$A:$A,$B295,'00 Alimenta'!D:D)*-1)","v":653733},{"$f":"IF('00 Aggregatore'!$D295=\"R\",SUMIF('00 Alimenta'!$A:$A,$B295,'00 Alimenta'!E:E),SUMIF('00 Alimenta'!$A:$A,$B295,'00 Alimenta'!E:E)*-1)","v":1507157}]
["BC","BA2850","Accantonamenti per rinnovi convenzioni Medici Sumai","C",{"$f":"IF('00 Aggregatore'!$D296=\"R\",SUMIF('00 Alimenta'!$A:$A,$B296,'00 Alimenta'!D:D),SUMIF('00 Alimenta'!$A:$A,$B296,'00 Alimenta'!D:D)*-1)","v":82934},{"$f":"IF('00 Aggregatore'!$D296=\"R\",SUMIF('00 Alimenta'!$A:$A,$B296,'00 Alimenta'!E:E),SUMIF('00 Alimenta'!$A:$A,$B296,'00 Alimenta'!E:E)*-1)","v":200998}]
["BC","BA2860","Accantonamenti per rinnovi contrattuali: dirigenza medica","C",{"$f":"IF('00 Aggregatore'!$D297=\"R\",SUMIF('00 Alimenta'!$A:$A,$B297,'00 Alimenta'!D:D),SUMIF('00 Alimenta'!$A:$A,$B297,'00 Alimenta'!D:D)*-1)","v":757797},{"$f":"IF('00 Aggregatore'!$D297=\"R\",SUMIF('00 Alimenta'!$A:$A,$B297,'00 Alimenta'!E:E),SUMIF('00 Alimenta'!$A:$A,$B297,'00 Alimenta'!E:E)*-1)","v":2419388}]
["BC","BA2870","Accantonamenti per rinnovi contrattuali: dirigenza non medica","C",{"$f":"IF('00 Aggregatore'!$D298=\"R\",SUMIF('00 Alimenta'!$A:$A,$B298,'00 Alimenta'!D:D),SUMIF('00 Alimenta'!$A:$A,$B298,'00 Alimenta'!D:D)*-1)","v":74949},{"$f":"IF('00 Aggregatore'!$D298=\"R\",SUMIF('00 Alimenta'!$A:$A,$B298,'00 Alimenta'!E:E),SUMIF('00 Alimenta'!$A:$A,$B298,'00 Alimenta'!E:E)*-1)","v":239284}]
["BC","BA2880","Accantonamenti per rinnovi contrattuali: comparto","C",{"$f":"IF('00 Aggregatore'!$D299=\"R\",SUMIF('00 Alimenta'!$A:$A,$B299,'00 Alimenta'!D:D),SUMIF('00 Alimenta'!$A:$A,$B299,'00 Alimenta'!D:D)*-1)","v":1008327},{"$f":"IF('00 Aggregatore'!$D299=\"R\",SUMIF('00 Alimenta'!$A:$A,$B299,'00 Alimenta'!E:E),SUMIF('00 Alimenta'!$A:$A,$B299,'00 Alimenta'!E:E)*-1)","v":0}]
["BC","BA2890","Altri accantonamenti","C",{"$f":"IF('00 Aggregatore'!$D300=\"R\",SUMIF('00 Alimenta'!$A:$A,$B300,'00 Alimenta'!D:D),SUMIF('00 Alimenta'!$A:$A,$B300,'00 Alimenta'!D:D)*-1)","v":300000},{"$f":"IF('00 Aggregatore'!$D300=\"R\",SUMIF('00 Alimenta'!$A:$A,$B300,'00 Alimenta'!E:E),SUMIF('00 Alimenta'!$A:$A,$B300,'00 Alimenta'!E:E)*-1)","v":2400000}]
["CR","CA0020","Interessi attivi su c/tesoreria unica","R",{"$f":"IF('00 Aggregatore'!$D301=\"R\",SUMIF('00 Alimenta'!$A:$A,$B301,'00 Alimenta'!D:D),SUMIF('00 Alimenta'!$A:$A,$B301,'00 Alimenta'!D:D)*-1)","v":0},{"$f":"IF('00 Aggregatore'!$D301=\"R\",SUMIF('00 Alimenta'!$A:$A,$B301,'00 Alimenta'!E:E),SUMIF('00 Alimenta'!$A:$A,$B301,'00 Alimenta'!E:E)*-1)","v":0}]
["CR","CA0030","Interessi attivi su c/c postali e bancari","R",{"$f":"IF('00 Aggregatore'!$D302=\"R\",SUMIF('00 Alimenta'!$A:$A,$B302,'00 Alimenta'!D:D),SUMIF('00 Alimenta'!$A:$A,$B302,'00 Alimenta'!D:D)*-1)","v":0},{"$f":"IF('00 Aggregatore'!$D302=\"R\",SUMIF('00 Alimenta'!$A:$A,$B302,'00 Alimenta'!E:E),SUMIF('00 Alimenta'!$A:$A,$B302,'00 Alimenta'!E:E)*-1)","v":1395.3}]
["CR","CA0040","Altri interessi attivi","R",{"$f":"IF('00 Aggregatore'!$D303=\"R\",SUMIF('00 Alimenta'!$A:$A,$B303,'00 Alimenta'!D:D),SUMIF('00 Alimenta'!$A:$A,$B303,'00 Alimenta'!D:D)*-1)","v":0},{"$f":"IF('00 Aggregatore'!$D303=\"R\",SUMIF('00 Alimenta'!$A:$A,$B303,'00 Alimenta'!E:E),SUMIF('00 Alimenta'!$A:$A,$B303,'00 Alimenta'!E:E)*-1)","v":0}]
["CR","CA0060","Proventi da partecipazioni","R",{"$f":"IF('00 Aggregatore'!$D304=\"R\",SUMIF('00 Alimenta'!$A:$A,$B304,'00 Alimenta'!D:D),SUMIF('00 Alimenta'!$A:$A,$B304,'00 Alimenta'!D:D)*-1)","v":0},{"$f":"IF('00 Aggregatore'!$D304=\"R\",SUMIF('00 Alimenta'!$A:$A,$B304,'00 Alimenta'!E:E),SUMIF('00 Alimenta'!$A:$A,$B304,'00 Alimenta'!E:E)*-1)","v":0}]
["CR","CA0070","Proventi finanziari da crediti iscritti nelle immobilizzazioni","R",{"$f":"IF('00 Aggregatore'!$D305=\"R\",SUMIF('00 Alimenta'!$A:$A,$B305,'00 Alimenta'!D:D),SUMIF('00 Alimenta'!$A:$A,$B305,'00 Alimenta'!D:D)*-1)","v":0},{"$f":"IF('00 Aggregatore'!$D305=\"R\",SUMIF('00 Alimenta'!$A:$A,$B305,'00 Alimenta'!E:E),SUMIF('00 Alimenta'!$A:$A,$B305,'00 Alimenta'!E:E)*-1)","v":0}]
["CR","CA0080","Proventi finanziari da titoli iscritti nelle immobilizzazioni","R",{"$f":"IF('00 Aggregatore'!$D306=\"R\",SUMIF('00 Alimenta'!$A:$A,$B306,'00 Alimenta'!D:D),SUMIF('00 Alimenta'!$A:$A,$B306,'00 Alimenta'!D:D)*-1)","v":0},{"$f":"IF('00 Aggregatore'!$D306=\"R\",SUMIF('00 Alimenta'!$A:$A,$B306,'00 Alimenta'!E:E),SUMIF('00 Alimenta'!$A:$A,$B306,'00 Alimenta'!E:E)*-1)","v":0}]
["CR","CA0090","Altri proventi finanziari diversi dai precedenti","R",{"$f":"IF('00 Aggregatore'!$D307=\"R\",SUMIF('00 Alimenta'!$A:$A,$B307,'00 Alimenta'!D:D),SUMIF('00 Alimenta'!$A:$A,$B307,'00 Alimenta'!D:D)*-1)","v":0},{"$f":"IF('00 Aggregatore'!$D307=\"R\",SUMIF('00 Alimenta'!$A:$A,$B307,'00 Alimenta'!E:E),SUMIF('00 Alimenta'!$A:$A,$B307,'00 Alimenta'!E:E)*-1)","v":0}]
["CR","CA0100","Utili su cambi","R",{"$f":"IF('00 Aggregatore'!$D308=\"R\",SUMIF('00 Alimenta'!$A:$A,$B308,'00 Alimenta'!D:D),SUMIF('00 Alimenta'!$A:$A,$B308,'00 Alimenta'!D:D)*-1)","v":0},{"$f":"IF('00 Aggregatore'!$D308=\"R\",SUMIF('00 Alimenta'!$A:$A,$B308,'00 Alimenta'!E:E),SUMIF('00 Alimenta'!$A:$A,$B308,'00 Alimenta'!E:E)*-1)","v":0}]
["CC","CA0120","Interessi passivi su anticipazioni di cassa","C",{"$f":"IF('00 Aggregatore'!$D309=\"R\",SUMIF('00 Alimenta'!$A:$A,$B309,'00 Alimenta'!D:D),SUMIF('00 Alimenta'!$A:$A,$B309,'00 Alimenta'!D:D)*-1)","v":0},{"$f":"IF('00 Aggregatore'!$D309=\"R\",SUMIF('00 Alimenta'!$A:$A,$B309,'00 Alimenta'!E:E),SUMIF('00 Alimenta'!$A:$A,$B309,'00 Alimenta'!E:E)*-1)","v":0}]
["CC","CA0130","Interessi passivi su mutui","C",{"$f":"IF('00 Aggregatore'!$D310=\"R\",SUMIF('00 Alimenta'!$A:$A,$B310,'00 Alimenta'!D:D),SUMIF('00 Alimenta'!$A:$A,$B310,'00 Alimenta'!D:D)*-1)","v":0},{"$f":"IF('00 Aggregatore'!$D310=\"R\",SUMIF('00 Alimenta'!$A:$A,$B310,'00 Alimenta'!E:E),SUMIF('00 Alimenta'!$A:$A,$B310,'00 Alimenta'!E:E)*-1)","v":0}]
["CC","CA0140","Altri interessi passivi","C",{"$f":"IF('00 Aggregatore'!$D311=\"R\",SUMIF('00 Alimenta'!$A:$A,$B311,'00 Alimenta'!D:D),SUMIF('00 Alimenta'!$A:$A,$B311,'00 Alimenta'!D:D)*-1)","v":157826.75},{"$f":"IF('00 Aggregatore'!$D311=\"R\",SUMIF('00 Alimenta'!$A:$A,$B311,'00 Alimenta'!E:E),SUMIF('00 Alimenta'!$A:$A,$B311,'00 Alimenta'!E:E)*-1)","v":1449403.09}]
["CC","CA0160","Altri oneri finanziari","C",{"$f":"IF('00 Aggregatore'!$D312=\"R\",SUMIF('00 Alimenta'!$A:$A,$B312,'00 Alimenta'!D:D),SUMIF('00 Alimenta'!$A:$A,$B312,'00 Alimenta'!D:D)*-1)","v":4522.33},{"$f":"IF('00 Aggregatore'!$D312=\"R\",SUMIF('00 Alimenta'!$A:$A,$B312,'00 Alimenta'!E:E),SUMIF('00 Alimenta'!$A:$A,$B312,'00 Alimenta'!E:E)*-1)","v":1932.36}]
["CC","CA0170","Perdite su cambi","C",{"$f":"IF('00 Aggregatore'!$D313=\"R\",SUMIF('00 Alimenta'!$A:$A,$B313,'00 Alimenta'!D:D),SUMIF('00 Alimenta'!$A:$A,$B313,'00 Alimenta'!D:D)*-1)","v":0},{"$f":"IF('00 Aggregatore'!$D313=\"R\",SUMIF('00 Alimenta'!$A:$A,$B313,'00 Alimenta'!E:E),SUMIF('00 Alimenta'!$A:$A,$B313,'00 Alimenta'!E:E)*-1)","v":0}]
["DR","DA0010","Rivalutazioni","R",{"$f":"IF('00 Aggregatore'!$D314=\"R\",SUMIF('00 Alimenta'!$A:$A,$B314,'00 Alimenta'!D:D),SUMIF('00 Alimenta'!$A:$A,$B314,'00 Alimenta'!D:D)*-1)","v":0},{"$f":"IF('00 Aggregatore'!$D314=\"R\",SUMIF('00 Alimenta'!$A:$A,$B314,'00 Alimenta'!E:E),SUMIF('00 Alimenta'!$A:$A,$B314,'00 Alimenta'!E:E)*-1)","v":0}]
["DC","DA0020","Svalutazioni","C",{"$f":"IF('00 Aggregatore'!$D315=\"R\",SUMIF('00 Alimenta'!$A:$A,$B315,'00 Alimenta'!D:D),SUMIF('00 Alimenta'!$A:$A,$B315,'00 Alimenta'!D:D)*-1)","v":0},{"$f":"IF('00 Aggregatore'!$D315=\"R\",SUMIF('00 Alimenta'!$A:$A,$B315,'00 Alimenta'!E:E),SUMIF('00 Alimenta'!$A:$A,$B315,'00 Alimenta'!E:E)*-1)","v":0}]
["ER","EA0020","Plusvalenze","R",{"$f":"IF('00 Aggregatore'!$D316=\"R\",SUMIF('00 Alimenta'!$A:$A,$B316,'00 Alimenta'!D:D),SUMIF('00 Alimenta'!$A:$A,$B316,'00 Alimenta'!D:D)*-1)","v":0},{"$f":"IF('00 Aggregatore'!$D316=\"R\",SUMIF('00 Alimenta'!$A:$A,$B316,'00 Alimenta'!E:E),SUMIF('00 Alimenta'!$A:$A,$B316,'00 Alimenta'!E:E)*-1)","v":0}]
["ER","EA0040","Proventi da donazioni e liberalità diverse","R",{"$f":"IF('00 Aggregatore'!$D317=\"R\",SUMIF('00 Alimenta'!$A:$A,$B317,'00 Alimenta'!D:D),SUMIF('00 Alimenta'!$A:$A,$B317,'00 Alimenta'!D:D)*-1)","v":0},{"$f":"IF('00 Aggregatore'!$D317=\"R\",SUMIF('00 Alimenta'!$A:$A,$B317,'00 Alimenta'!E:E),SUMIF('00 Alimenta'!$A:$A,$B317,'00 Alimenta'!E:E)*-1)","v":0}]
["ER","EA0060","Sopravvenienze attive v/Aziende sanitarie pubbliche della Regione","R",{"$f":"IF('00 Aggregatore'!$D318=\"R\",SUMIF('00 Alimenta'!$A:$A,$B318,'00 Alimenta'!D:D),SUMIF('00 Alimenta'!$A:$A,$B318,'00 Alimenta'!D:D)*-1)","v":2049452.26},{"$f":"IF('00 Aggregatore'!$D318=\"R\",SUMIF('00 Alimenta'!$A:$A,$B318,'00 Alimenta'!E:E),SUMIF('00 Alimenta'!$A:$A,$B318,'00 Alimenta'!E:E)*-1)","v":3054055.48}]
["ER","EA0080","Sopravvenienze attive v/terzi relative alla mobilità extraregionale","R",{"$f":"IF('00 Aggregatore'!$D319=\"R\",SUMIF('00 Alimenta'!$A:$A,$B319,'00 Alimenta'!D:D),SUMIF('00 Alimenta'!$A:$A,$B319,'00 Alimenta'!D:D)*-1)","v":0},{"$f":"IF('00 Aggregatore'!$D319=\"R\",SUMIF('00 Alimenta'!$A:$A,$B319,'00 Alimenta'!E:E),SUMIF('00 Alimenta'!$A:$A,$B319,'00 Alimenta'!E:E)*-1)","v":0}]
["ER","EA0090","Sopravvenienze attive v/terzi relative al personale","R",{"$f":"IF('00 Aggregatore'!$D320=\"R\",SUMIF('00 Alimenta'!$A:$A,$B320,'00 Alimenta'!D:D),SUMIF('00 Alimenta'!$A:$A,$B320,'00 Alimenta'!D:D)*-1)","v":0},{"$f":"IF('00 Aggregatore'!$D320=\"R\",SUMIF('00 Alimenta'!$A:$A,$B320,'00 Alimenta'!E:E),SUMIF('00 Alimenta'!$A:$A,$B320,'00 Alimenta'!E:E)*-1)","v":0}]
["ER","EA0100","Sopravvenienze attive v/terzi relative alle convenzioni con medici di base","R",{"$f":"IF('00 Aggregatore'!$D321=\"R\",SUMIF('00 Alimenta'!$A:$A,$B321,'00 Alimenta'!D:D),SUMIF('00 Alimenta'!$A:$A,$B321,'00 Alimenta'!D:D)*-1)","v":0},{"$f":"IF('00 Aggregatore'!$D321=\"R\",SUMIF('00 Alimenta'!$A:$A,$B321,'00 Alimenta'!E:E),SUMIF('00 Alimenta'!$A:$A,$B321,'00 Alimenta'!E:E)*-1)","v":0}]
["ER","EA0110","Sopravvenienze attive v/terzi relative alle convenzioni per la specialistica","R",{"$f":"IF('00 Aggregatore'!$D322=\"R\",SUMIF('00 Alimenta'!$A:$A,$B322,'00 Alimenta'!D:D),SUMIF('00 Alimenta'!$A:$A,$B322,'00 Alimenta'!D:D)*-1)","v":0},{"$f":"IF('00 Aggregatore'!$D322=\"R\",SUMIF('00 Alimenta'!$A:$A,$B322,'00 Alimenta'!E:E),SUMIF('00 Alimenta'!$A:$A,$B322,'00 Alimenta'!E:E)*-1)","v":0}]
["ER","EA0120","Sopravvenienze attive v/terzi relative all'acquisto di prestazioni sanitarie da operatori accreditati","R",{"$f":"IF('00 Aggregatore'!$D323=\"R\",SUMIF('00 Alimenta'!$A:$A,$B323,'00 Alimenta'!D:D),SUMIF('00 Alimenta'!$A:$A,$B323,'00 Alimenta'!D:D)*-1)","v":2999852.73},{"$f":"IF('00 Aggregatore'!$D323=\"R\",SUMIF('00 Alimenta'!$A:$A,$B323,'00 Alimenta'!E:E),SUMIF('00 Alimenta'!$A:$A,$B323,'00 Alimenta'!E:E)*-1)","v":2636094.7400000002}]
["ER","EA0130","Sopravvenienze attive v/terzi relative all'acquisto di beni e servizi","R",{"$f":"IF('00 Aggregatore'!$D324=\"R\",SUMIF('00 Alimenta'!$A:$A,$B324,'00 Alimenta'!D:D),SUMIF('00 Alimenta'!$A:$A,$B324,'00 Alimenta'!D:D)*-1)","v":341295.78},{"$f":"IF('00 Aggregatore'!$D324=\"R\",SUMIF('00 Alimenta'!$A:$A,$B324,'00 Alimenta'!E:E),SUMIF('00 Alimenta'!$A:$A,$B324,'00 Alimenta'!E:E)*-1)","v":468853.64}]
["ER","EA0140","Altre sopravvenienze attive v/terzi","R",{"$f":"IF('00 Aggregatore'!$D325=\"R\",SUMIF('00 Alimenta'!$A:$A,$B325,'00 Alimenta'!D:D),SUMIF('00 Alimenta'!$A:$A,$B325,'00 Alimenta'!D:D)*-1)","v":2010658.93},{"$f":"IF('00 Aggregatore'!$D325=\"R\",SUMIF('00 Alimenta'!$A:$A,$B325,'00 Alimenta'!E:E),SUMIF('00 Alimenta'!$A:$A,$B325,'00 Alimenta'!E:E)*-1)","v":1380885.09}]
[{"$f":"LEFT(B326,1)&D326","v":"ER"},"EA0160","Insussistenze attive v/Aziende sanitarie pubbliche della Regione","R",{"$f":"IF('00 Aggregatore'!$D326=\"R\",SUMIF('00 Alimenta'!$A:$A,$B326,'00 Alimenta'!D:D),SUMIF('00 Alimenta'!$A:$A,$B326,'00 Alimenta'!D:D)*-1)","v":0},{"$f":"IF('00 Aggregatore'!$D326=\"R\",SUMIF('00 Alimenta'!$A:$A,$B326,'00 Alimenta'!E:E),SUMIF('00 Alimenta'!$A:$A,$B326,'00 Alimenta'!E:E)*-1)","v":0}]
["ER","EA0180","Insussistenze attive v/terzi relative alla mobilità extraregionale","R",{"$f":"IF('00 Aggregatore'!$D327=\"R\",SUMIF('00 Alimenta'!$A:$A,$B327,'00 Alimenta'!D:D),SUMIF('00 Alimenta'!$A:$A,$B327,'00 Alimenta'!D:D)*-1)","v":0},{"$f":"IF('00 Aggregatore'!$D327=\"R\",SUMIF('00 Alimenta'!$A:$A,$B327,'00 Alimenta'!E:E),SUMIF('00 Alimenta'!$A:$A,$B327,'00 Alimenta'!E:E)*-1)","v":0}]
["ER","EA0190","Insussistenze attive v/terzi relative al personale","R",{"$f":"IF('00 Aggregatore'!$D328=\"R\",SUMIF('00 Alimenta'!$A:$A,$B328,'00 Alimenta'!D:D),SUMIF('00 Alimenta'!$A:$A,$B328,'00 Alimenta'!D:D)*-1)","v":0},{"$f":"IF('00 Aggregatore'!$D328=\"R\",SUMIF('00 Alimenta'!$A:$A,$B328,'00 Alimenta'!E:E),SUMIF('00 Alimenta'!$A:$A,$B328,'00 Alimenta'!E:E)*-1)","v":0}]
["ER","EA0200","Insussistenze attive v/terzi relative alle convenzioni con medici di base","R",{"$f":"IF('00 Aggregatore'!$D329=\"R\",SUMIF('00 Alimenta'!$A:$A,$B329,'00 Alimenta'!D:D),SUMIF('00 Alimenta'!$A:$A,$B329,'00 Alimenta'!D:D)*-1)","v":0},{"$f":"IF('00 Aggregatore'!$D329=\"R\",SUMIF('00 Alimenta'!$A:$A,$B329,'00 Alimenta'!E:E),SUMIF('00 Alimenta'!$A:$A,$B329,'00 Alimenta'!E:E)*-1)","v":0}]
["ER","EA0210","Insussistenze attive v/terzi relative alle convenzioni per la specialistica","R",{"$f":"IF('00 Aggregatore'!$D330=\"R\",SUMIF('00 Alimenta'!$A:$A,$B330,'00 Alimenta'!D:D),SUMIF('00 Alimenta'!$A:$A,$B330,'00 Alimenta'!D:D)*-1)","v":0},{"$f":"IF('00 Aggregatore'!$D330=\"R\",SUMIF('00 Alimenta'!$A:$A,$B330,'00 Alimenta'!E:E),SUMIF('00 Alimenta'!$A:$A,$B330,'00 Alimenta'!E:E)*-1)","v":0}]
["ER","EA0220","Insussistenze attive v/terzi relative all'acquisto di prestazioni sanitarie da operatori accreditati","R",{"$f":"IF('00 Aggregatore'!$D331=\"R\",SUMIF('00 Alimenta'!$A:$A,$B331,'00 Alimenta'!D:D),SUMIF('00 Alimenta'!$A:$A,$B331,'00 Alimenta'!D:D)*-1)","v":1672403.91},{"$f":"IF('00 Aggregatore'!$D331=\"R\",SUMIF('00 Alimenta'!$A:$A,$B331,'00 Alimenta'!E:E),SUMIF('00 Alimenta'!$A:$A,$B331,'00 Alimenta'!E:E)*-1)","v":326389.61}]
["ER","EA0230","Insussistenze attive v/terzi relative all'acquisto di beni e servizi","R",{"$f":"IF('00 Aggregatore'!$D332=\"R\",SUMIF('00 Alimenta'!$A:$A,$B332,'00 Alimenta'!D:D),SUMIF('00 Alimenta'!$A:$A,$B332,'00 Alimenta'!D:D)*-1)","v":288245.17},{"$f":"IF('00 Aggregatore'!$D332=\"R\",SUMIF('00 Alimenta'!$A:$A,$B332,'00 Alimenta'!E:E),SUMIF('00 Alimenta'!$A:$A,$B332,'00 Alimenta'!E:E)*-1)","v":4775754.84}]
["ER","EA0240","Altre insussistenze attive v/terzi","R",{"$f":"IF('00 Aggregatore'!$D333=\"R\",SUMIF('00 Alimenta'!$A:$A,$B333,'00 Alimenta'!D:D),SUMIF('00 Alimenta'!$A:$A,$B333,'00 Alimenta'!D:D)*-1)","v":125240.07},{"$f":"IF('00 Aggregatore'!$D333=\"R\",SUMIF('00 Alimenta'!$A:$A,$B333,'00 Alimenta'!E:E),SUMIF('00 Alimenta'!$A:$A,$B333,'00 Alimenta'!E:E)*-1)","v":68794.210000000006}]
["ER","EA0250","Altri proventi straordinari","R",{"$f":"IF('00 Aggregatore'!$D334=\"R\",SUMIF('00 Alimenta'!$A:$A,$B334,'00 Alimenta'!D:D),SUMIF('00 Alimenta'!$A:$A,$B334,'00 Alimenta'!D:D)*-1)","v":0},{"$f":"IF('00 Aggregatore'!$D334=\"R\",SUMIF('00 Alimenta'!$A:$A,$B334,'00 Alimenta'!E:E),SUMIF('00 Alimenta'!$A:$A,$B334,'00 Alimenta'!E:E)*-1)","v":0}]
["EC","EA0270","Minusvalenze","C",{"$f":"IF('00 Aggregatore'!$D335=\"R\",SUMIF('00 Alimenta'!$A:$A,$B335,'00 Alimenta'!D:D),SUMIF('00 Alimenta'!$A:$A,$B335,'00 Alimenta'!D:D)*-1)","v":0},{"$f":"IF('00 Aggregatore'!$D335=\"R\",SUMIF('00 Alimenta'!$A:$A,$B335,'00 Alimenta'!E:E),SUMIF('00 Alimenta'!$A:$A,$B335,'00 Alimenta'!E:E)*-1)","v":19530.05}]
["EC","EA0290","Oneri tributari da esercizi precedenti","C",{"$f":"IF('00 Aggregatore'!$D336=\"R\",SUMIF('00 Alimenta'!$A:$A,$B336,'00 Alimenta'!D:D),SUMIF('00 Alimenta'!$A:$A,$B336,'00 Alimenta'!D:D)*-1)","v":0},{"$f":"IF('00 Aggregatore'!$D336=\"R\",SUMIF('00 Alimenta'!$A:$A,$B336,'00 Alimenta'!E:E),SUMIF('00 Alimenta'!$A:$A,$B336,'00 Alimenta'!E:E)*-1)","v":0}]
["EC","EA0300","Oneri da cause civili e oneri processuali","C",{"$f":"IF('00 Aggregatore'!$D337=\"R\",SUMIF('00 Alimenta'!$A:$A,$B337,'00 Alimenta'!D:D),SUMIF('00 Alimenta'!$A:$A,$B337,'00 Alimenta'!D:D)*-1)","v":0},{"$f":"IF('00 Aggregatore'!$D337=\"R\",SUMIF('00 Alimenta'!$A:$A,$B337,'00 Alimenta'!E:E),SUMIF('00 Alimenta'!$A:$A,$B337,'00 Alimenta'!E:E)*-1)","v":0}]
["EC","EA0330","Sopravvenienze passive v/Aziende sanitarie pubbliche relative alla mobilità intraregionale","C",{"$f":"IF('00 Aggregatore'!$D338=\"R\",SUMIF('00 Alimenta'!$A:$A,$B338,'00 Alimenta'!D:D),SUMIF('00 Alimenta'!$A:$A,$B338,'00 Alimenta'!D:D)*-1)","v":0},{"$f":"IF('00 Aggregatore'!$D338=\"R\",SUMIF('00 Alimenta'!$A:$A,$B338,'00 Alimenta'!E:E),SUMIF('00 Alimenta'!$A:$A,$B338,'00 Alimenta'!E:E)*-1)","v":0}]
["EC","EA0340","Altre sopravvenienze passive v/Aziende sanitarie pubbliche della Regione","C",{"$f":"IF('00 Aggregatore'!$D339=\"R\",SUMIF('00 Alimenta'!$A:$A,$B339,'00 Alimenta'!D:D),SUMIF('00 Alimenta'!$A:$A,$B339,'00 Alimenta'!D:D)*-1)","v":134078.51},{"$f":"IF('00 Aggregatore'!$D339=\"R\",SUMIF('00 Alimenta'!$A:$A,$B339,'00 Alimenta'!E:E),SUMIF('00 Alimenta'!$A:$A,$B339,'00 Alimenta'!E:E)*-1)","v":122869.51}]
["EC","EA0360","Sopravvenienze passive v/terzi relative alla mobilità extraregionale","C",{"$f":"IF('00 Aggregatore'!$D340=\"R\",SUMIF('00 Alimenta'!$A:$A,$B340,'00 Alimenta'!D:D),SUMIF('00 Alimenta'!$A:$A,$B340,'00 Alimenta'!D:D)*-1)","v":0},{"$f":"IF('00 Aggregatore'!$D340=\"R\",SUMIF('00 Alimenta'!$A:$A,$B340,'00 Alimenta'!E:E),SUMIF('00 Alimenta'!$A:$A,$B340,'00 Alimenta'!E:E)*-1)","v":0}]
["EC","EA0380","Sopravvenienze passive v/terzi relative al personale - dirigenza medica","C",{"$f":"IF('00 Aggregatore'!$D341=\"R\",SUMIF('00 Alimenta'!$A:$A,$B341,'00 Alimenta'!D:D),SUMIF('00 Alimenta'!$A:$A,$B341,'00 Alimenta'!D:D)*-1)","v":183240.74},{"$f":"IF('00 Aggregatore'!$D341=\"R\",SUMIF('00 Alimenta'!$A:$A,$B341,'00 Alimenta'!E:E),SUMIF('00 Alimenta'!$A:$A,$B341,'00 Alimenta'!E:E)*-1)","v":3919.87}]
["EC","EA0390","Sopravvenienze passive v/terzi relative al personale - dirigenza non medica","C",{"$f":"IF('00 Aggregatore'!$D342=\"R\",SUMIF('00 Alimenta'!$A:$A,$B342,'00 Alimenta'!D:D),SUMIF('00 Alimenta'!$A:$A,$B342,'00 Alimenta'!D:D)*-1)","v":5333.38},{"$f":"IF('00 Aggregatore'!$D342=\"R\",SUMIF('00 Alimenta'!$A:$A,$B342,'00 Alimenta'!E:E),SUMIF('00 Alimenta'!$A:$A,$B342,'00 Alimenta'!E:E)*-1)","v":7520.5}]
["EC","EA0400","Sopravvenienze passive v/terzi relative al personale - Comparto","C",{"$f":"IF('00 Aggregatore'!$D343=\"R\",SUMIF('00 Alimenta'!$A:$A,$B343,'00 Alimenta'!D:D),SUMIF('00 Alimenta'!$A:$A,$B343,'00 Alimenta'!D:D)*-1)","v":363166.05},{"$f":"IF('00 Aggregatore'!$D343=\"R\",SUMIF('00 Alimenta'!$A:$A,$B343,'00 Alimenta'!E:E),SUMIF('00 Alimenta'!$A:$A,$B343,'00 Alimenta'!E:E)*-1)","v":2590077.62}]
["EC","EA0410","Sopravvenienze passive v/terzi relative alle convenzioni con medici di base","C",{"$f":"IF('00 Aggregatore'!$D344=\"R\",SUMIF('00 Alimenta'!$A:$A,$B344,'00 Alimenta'!D:D),SUMIF('00 Alimenta'!$A:$A,$B344,'00 Alimenta'!D:D)*-1)","v":0},{"$f":"IF('00 Aggregatore'!$D344=\"R\",SUMIF('00 Alimenta'!$A:$A,$B344,'00 Alimenta'!E:E),SUMIF('00 Alimenta'!$A:$A,$B344,'00 Alimenta'!E:E)*-1)","v":2272.9499999999998}]
["EC","EA0420","Sopravvenienze passive v/terzi relative alle convenzioni per la specialistica","C",{"$f":"IF('00 Aggregatore'!$D345=\"R\",SUMIF('00 Alimenta'!$A:$A,$B345,'00 Alimenta'!D:D),SUMIF('00 Alimenta'!$A:$A,$B345,'00 Alimenta'!D:D)*-1)","v":48576.12},{"$f":"IF('00 Aggregatore'!$D345=\"R\",SUMIF('00 Alimenta'!$A:$A,$B345,'00 Alimenta'!E:E),SUMIF('00 Alimenta'!$A:$A,$B345,'00 Alimenta'!E:E)*-1)","v":53207.86}]
["EC","EA0430","Sopravvenienze passive v/terzi relative all'acquisto di prestazioni sanitarie da operatori accreditati","C",{"$f":"IF('00 Aggregatore'!$D346=\"R\",SUMIF('00 Alimenta'!$A:$A,$B346,'00 Alimenta'!D:D),SUMIF('00 Alimenta'!$A:$A,$B346,'00 Alimenta'!D:D)*-1)","v":25282.29},{"$f":"IF('00 Aggregatore'!$D346=\"R\",SUMIF('00 Alimenta'!$A:$A,$B346,'00 Alimenta'!E:E),SUMIF('00 Alimenta'!$A:$A,$B346,'00 Alimenta'!E:E)*-1)","v":965342.11}]
["EC","EA0440","Sopravvenienze passive v/terzi relative all'acquisto di beni e servizi","C",{"$f":"IF('00 Aggregatore'!$D347=\"R\",SUMIF('00 Alimenta'!$A:$A,$B347,'00 Alimenta'!D:D),SUMIF('00 Alimenta'!$A:$A,$B347,'00 Alimenta'!D:D)*-1)","v":2651265.85},{"$f":"IF('00 Aggregatore'!$D347=\"R\",SUMIF('00 Alimenta'!$A:$A,$B347,'00 Alimenta'!E:E),SUMIF('00 Alimenta'!$A:$A,$B347,'00 Alimenta'!E:E)*-1)","v":2001061.54}]
["EC","EA0450","Altre sopravvenienze passive v/terzi","C",{"$f":"IF('00 Aggregatore'!$D348=\"R\",SUMIF('00 Alimenta'!$A:$A,$B348,'00 Alimenta'!D:D),SUMIF('00 Alimenta'!$A:$A,$B348,'00 Alimenta'!D:D)*-1)","v":134394.78},{"$f":"IF('00 Aggregatore'!$D348=\"R\",SUMIF('00 Alimenta'!$A:$A,$B348,'00 Alimenta'!E:E),SUMIF('00 Alimenta'!$A:$A,$B348,'00 Alimenta'!E:E)*-1)","v":557030.55000000005}]
["EC","EA0470","Insussistenze passive v/Aziende sanitarie pubbliche della Regione","C",{"$f":"IF('00 Aggregatore'!$D349=\"R\",SUMIF('00 Alimenta'!$A:$A,$B349,'00 Alimenta'!D:D),SUMIF('00 Alimenta'!$A:$A,$B349,'00 Alimenta'!D:D)*-1)","v":0},{"$f":"IF('00 Aggregatore'!$D349=\"R\",SUMIF('00 Alimenta'!$A:$A,$B349,'00 Alimenta'!E:E),SUMIF('00 Alimenta'!$A:$A,$B349,'00 Alimenta'!E:E)*-1)","v":0}]
["EC","EA0490","Insussistenze passive v/terzi relative alla mobilità extraregionale","C",{"$f":"IF('00 Aggregatore'!$D350=\"R\",SUMIF('00 Alimenta'!$A:$A,$B350,'00 Alimenta'!D:D),SUMIF('00 Alimenta'!$A:$A,$B350,'00 Alimenta'!D:D)*-1)","v":0},{"$f":"IF('00 Aggregatore'!$D350=\"R\",SUMIF('00 Alimenta'!$A:$A,$B350,'00 Alimenta'!E:E),SUMIF('00 Alimenta'!$A:$A,$B350,'00 Alimenta'!E:E)*-1)","v":0}]
["EC","EA0500","Insussistenze passive v/terzi relative al personale","C",{"$f":"IF('00 Aggregatore'!$D351=\"R\",SUMIF('00 Alimenta'!$A:$A,$B351,'00 Alimenta'!D:D),SUMIF('00 Alimenta'!$A:$A,$B351,'00 Alimenta'!D:D)*-1)","v":0},{"$f":"IF('00 Aggregatore'!$D351=\"R\",SUMIF('00 Alimenta'!$A:$A,$B351,'00 Alimenta'!E:E),SUMIF('00 Alimenta'!$A:$A,$B351,'00 Alimenta'!E:E)*-1)","v":0}]
["EC","EA0510","Insussistenze passive v/terzi relative alle convenzioni con medici di base","C",{"$f":"IF('00 Aggregatore'!$D352=\"R\",SUMIF('00 Alimenta'!$A:$A,$B352,'00 Alimenta'!D:D),SUMIF('00 Alimenta'!$A:$A,$B352,'00 Alimenta'!D:D)*-1)","v":0},{"$f":"IF('00 Aggregatore'!$D352=\"R\",SUMIF('00 Alimenta'!$A:$A,$B352,'00 Alimenta'!E:E),SUMIF('00 Alimenta'!$A:$A,$B352,'00 Alimenta'!E:E)*-1)","v":0}]
["EC","EA0520","Insussistenze passive v/terzi relative alle convenzioni per la specialistica","C",{"$f":"IF('00 Aggregatore'!$D353=\"R\",SUMIF('00 Alimenta'!$A:$A,$B353,'00 Alimenta'!D:D),SUMIF('00 Alimenta'!$A:$A,$B353,'00 Alimenta'!D:D)*-1)","v":0},{"$f":"IF('00 Aggregatore'!$D353=\"R\",SUMIF('00 Alimenta'!$A:$A,$B353,'00 Alimenta'!E:E),SUMIF('00 Alimenta'!$A:$A,$B353,'00 Alimenta'!E:E)*-1)","v":0}]
["EC","EA0530","Insussistenze passive v/terzi relative all'acquisto di prestazioni sanitarie da operatori accreditati","C",{"$f":"IF('00 Aggregatore'!$D354=\"R\",SUMIF('00 Alimenta'!$A:$A,$B354,'00 Alimenta'!D:D),SUMIF('00 Alimenta'!$A:$A,$B354,'00 Alimenta'!D:D)*-1)","v":832320.62},{"$f":"IF('00 Aggregatore'!$D354=\"R\",SUMIF('00 Alimenta'!$A:$A,$B354,'00 Alimenta'!E:E),SUMIF('00 Alimenta'!$A:$A,$B354,'00 Alimenta'!E:E)*-1)","v":907726.79}]
["EC","EA0540","Insussistenze passive v/terzi relative all'acquisto di beni e servizi","C",{"$f":"IF('00 Aggregatore'!$D355=\"R\",SUMIF('00 Alimenta'!$A:$A,$B355,'00 Alimenta'!D:D),SUMIF('00 Alimenta'!$A:$A,$B355,'00 Alimenta'!D:D)*-1)","v":115363.27},{"$f":"IF('00 Aggregatore'!$D355=\"R\",SUMIF('00 Alimenta'!$A:$A,$B355,'00 Alimenta'!E:E),SUMIF('00 Alimenta'!$A:$A,$B355,'00 Alimenta'!E:E)*-1)","v":33658.5}]
["EC","EA0550","Altre insussistenze passive v/terzi","C",{"$f":"IF('00 Aggregatore'!$D356=\"R\",SUMIF('00 Alimenta'!$A:$A,$B356,'00 Alimenta'!D:D),SUMIF('00 Alimenta'!$A:$A,$B356,'00 Alimenta'!D:D)*-1)","v":76578.070000000007},{"$f":"IF('00 Aggregatore'!$D356=\"R\",SUMIF('00 Alimenta'!$A:$A,$B356,'00 Alimenta'!E:E),SUMIF('00 Alimenta'!$A:$A,$B356,'00 Alimenta'!E:E)*-1)","v":171030.37}]
["EC","EA0560","Altri oneri straordinari","C",{"$f":"IF('00 Aggregatore'!$D357=\"R\",SUMIF('00 Alimenta'!$A:$A,$B357,'00 Alimenta'!D:D),SUMIF('00 Alimenta'!$A:$A,$B357,'00 Alimenta'!D:D)*-1)","v":0},{"$f":"IF('00 Aggregatore'!$D357=\"R\",SUMIF('00 Alimenta'!$A:$A,$B357,'00 Alimenta'!E:E),SUMIF('00 Alimenta'!$A:$A,$B357,'00 Alimenta'!E:E)*-1)","v":0}]
["YC","YA0020","IRAP relativa a personale dipendente","C",{"$f":"IF('00 Aggregatore'!$D358=\"R\",SUMIF('00 Alimenta'!$A:$A,$B358,'00 Alimenta'!D:D),SUMIF('00 Alimenta'!$A:$A,$B358,'00 Alimenta'!D:D)*-1)","v":10634384.52},{"$f":"IF('00 Aggregatore'!$D358=\"R\",SUMIF('00 Alimenta'!$A:$A,$B358,'00 Alimenta'!E:E),SUMIF('00 Alimenta'!$A:$A,$B358,'00 Alimenta'!E:E)*-1)","v":11109282.459999999}]
["YC","YA0030","IRAP relativa a collaboratori e personale assimilato a lavoro dipendente","C",{"$f":"IF('00 Aggregatore'!$D359=\"R\",SUMIF('00 Alimenta'!$A:$A,$B359,'00 Alimenta'!D:D),SUMIF('00 Alimenta'!$A:$A,$B359,'00 Alimenta'!D:D)*-1)","v":470809.27999999997},{"$f":"IF('00 Aggregatore'!$D359=\"R\",SUMIF('00 Alimenta'!$A:$A,$B359,'00 Alimenta'!E:E),SUMIF('00 Alimenta'!$A:$A,$B359,'00 Alimenta'!E:E)*-1)","v":577892.56999999995}]
["YC","YA0040","IRAP relativa ad attività di libera professione (intramoenia)","C",{"$f":"IF('00 Aggregatore'!$D360=\"R\",SUMIF('00 Alimenta'!$A:$A,$B360,'00 Alimenta'!D:D),SUMIF('00 Alimenta'!$A:$A,$B360,'00 Alimenta'!D:D)*-1)","v":458072.41000000003},{"$f":"IF('00 Aggregatore'!$D360=\"R\",SUMIF('00 Alimenta'!$A:$A,$B360,'00 Alimenta'!E:E),SUMIF('00 Alimenta'!$A:$A,$B360,'00 Alimenta'!E:E)*-1)","v":418750.77}]
["YC","YA0050","IRAP relativa ad attività commerciale","C",{"$f":"IF('00 Aggregatore'!$D361=\"R\",SUMIF('00 Alimenta'!$A:$A,$B361,'00 Alimenta'!D:D),SUMIF('00 Alimenta'!$A:$A,$B361,'00 Alimenta'!D:D)*-1)","v":93278.75},{"$f":"IF('00 Aggregatore'!$D361=\"R\",SUMIF('00 Alimenta'!$A:$A,$B361,'00 Alimenta'!E:E),SUMIF('00 Alimenta'!$A:$A,$B361,'00 Alimenta'!E:E)*-1)","v":0}]
["YC","YA0070","IRES su attività istituzionale","C",{"$f":"IF('00 Aggregatore'!$D362=\"R\",SUMIF('00 Alimenta'!$A:$A,$B362,'00 Alimenta'!D:D),SUMIF('00 Alimenta'!$A:$A,$B362,'00 Alimenta'!D:D)*-1)","v":0},{"$f":"IF('00 Aggregatore'!$D362=\"R\",SUMIF('00 Alimenta'!$A:$A,$B362,'00 Alimenta'!E:E),SUMIF('00 Alimenta'!$A:$A,$B362,'00 Alimenta'!E:E)*-1)","v":0}]
["YC","YA0080","IRES su attività commerciale","C",{"$f":"IF('00 Aggregatore'!$D363=\"R\",SUMIF('00 Alimenta'!$A:$A,$B363,'00 Alimenta'!D:D),SUMIF('00 Alimenta'!$A:$A,$B363,'00 Alimenta'!D:D)*-1)","v":490066},{"$f":"IF('00 Aggregatore'!$D363=\"R\",SUMIF('00 Alimenta'!$A:$A,$B363,'00 Alimenta'!E:E),SUMIF('00 Alimenta'!$A:$A,$B363,'00 Alimenta'!E:E)*-1)","v":408274}]
["YC","YA0090","Accantonamento a Fondo Imposte (Accertamenti, condoni, ecc.)","C",{"$f":"IF('00 Aggregatore'!$D364=\"R\",SUMIF('00 Alimenta'!$A:$A,$B364,'00 Alimenta'!D:D),SUMIF('00 Alimenta'!$A:$A,$B364,'00 Alimenta'!D:D)*-1)","v":0},{"$f":"IF('00 Aggregatore'!$D364=\"R\",SUMIF('00 Alimenta'!$A:$A,$B364,'00 Alimenta'!E:E),SUMIF('00 Alimenta'!$A:$A,$B364,'00 Alimenta'!E:E)*-1)","v":0}]
[]
[null,"AR","VALORE DELLA PRODUZIONE - RICAVI",null,{"$f":"SUMIF($A:$A,$B366,E:E)","v":706064340.40999997},726128606.7299999]
[null,"CR","PROVENTI ED ONERI FINAZIARI - RICAVI",null,0,1395.3]
[null,"DR","RETTIFICHE DI VALORE ATTIVITA' FINANZIARIE - RICAVI",null,0,0]
[null,"ER","PROVENTI ED ONERI STRAORDINARI -RICAVI",null,9487148.8499999996,12710827.610000001]
[null,"BC","COSTI DELLA PRODUZIONE - COSTI",null,712282553.79999948,717438368.82999957]
[null,"CC","PROVENTI ED ONERI FINAZIARI - COSTI",null,162349.07999999999,1451335.4500000002]
[null,"DC","RETTIFICHE DI VALORE ATTIVITA' FINANZIARIE - COSTI",null,0,0]
[null,"EC","PROVENTI ED ONERI STRAORDINARI - COSTI",null,4569599.68,7435248.2199999997]
[null,"YC","IMPOSTE E TASSE - COSTI",null,12146610.959999999,12514199.799999999]
[null,null,"UTILE/PERDITA DI ESERCIZIO",null,{"$f":"(E366+E367+E368+E369)-(E370+E371+E372+E373+E374)","v":-13609624.259999514},{"$f":"(F366+F367+F368+F369)-(F370+F371+F372+F373+F374)","v":1677.3400002717972}]

{"sheet":"00 CE","index":2,"n_rows":488,"n_cols":7,"rows_kept":488,"cut":false,"hidden":false,"merged":[]}
[]
["AGG","CODICE","VOCE MODELLO CE",null,null,{"$f":"'00 Aggregatore'!E4","v":"Esercizio 2017"},{"$f":"'00 Aggregatore'!F4","v":"Esercizio 2018"}]
[null,null,"A)  Valore della produzione"]
[null,"AA0010","A.1)  Contributi in c/esercizio","S","AA0010",{"$f":"F5+F8+F21+F26","v":562861140.55000007},{"$f":"G5+G8+G21+G26","v":569823505.82000005}]
[null,"AA0020","A.1.A)  Contributi da Regione o Prov. Aut. per quota F.S. regionale","S","AA0020",{"$f":"SUM(F6:F7)","v":562581352.20000005},{"$f":"SUM(G6:G7)","v":569244565.85000002}]
[null,"AA0030","A.1.A.1)  da Regione o Prov. Aut. per quota F.S. regionale indistinto",null,"AA0030",{"$f":"SUMIF('00 Aggregatore'!$B:$B,'00 CE'!$E6,'00 Aggregatore'!E:E)","v":547765886.61000001},{"$f":"SUMIF('00 Aggregatore'!$B:$B,'00 CE'!$E6,'00 Aggregatore'!F:F)","v":555479764.00999999}]
[null,"AA0040","A.1.A.2)  da Regione o Prov. Aut. per quota F.S. regionale vincolato",null,"AA0040",{"$f":"SUMIF('00 Aggregatore'!$B:$B,'00 CE'!$E7,'00 Aggregatore'!E:E)","v":14815465.59},{"$f":"SUMIF('00 Aggregatore'!$B:$B,'00 CE'!$E7,'00 Aggregatore'!F:F)","v":13764801.84}]
[null,"AA0050","A.1.B)  Contributi c/esercizio (extra fondo)","S","AA0050",{"$f":"F9+F14+F17","v":279788.34999999998},{"$f":"G9+G14+G17","v":578939.97}]
[null,"AA0060","A.1.B.1)  da Regione o Prov. Aut. (extra fondo) ","S","AA0060",{"$f":"SUM(F10:F13)","v":123104.1},{"$f":"SUM(G10:G13)","v":410404.72}]
[null,"AA0070","A.1.B.1.1)  Contributi da Regione o Prov. Aut. (extra fondo) vincolati",null,"AA0070",{"$f":"SUMIF('00 Aggregatore'!$B:$B,'00 CE'!$E10,'00 Aggregatore'!E:E)","v":123104.1},{"$f":"SUMIF('00 Aggregatore'!$B:$B,'00 CE'!$E10,'00 Aggregatore'!F:F)","v":410404.72}]
[null,"AA0080","A.1.B.1.2)  Contributi da Regione o Prov. Aut. (extra fondo) - Risorse aggiuntive da bilancio regionale a titolo di copertura LEA",null,"AA0080",{"$f":"SUMIF('00 Aggregatore'!$B:$B,'00 CE'!$E11,'00 Aggregatore'!E:E)","v":0},{"$f":"SUMIF('00 Aggregatore'!$B:$B,'00 CE'!$E11,'00 Aggregatore'!F:F)","v":0}]
[null,"AA0090","A.1.B.1.3)  Contributi da Regione o Prov. Aut. (extra fondo) - Risorse aggiuntive da bilancio regionale a titolo di copertura extra LEA",null,"AA0090",{"$f":"SUMIF('00 Aggregatore'!$B:$B,'00 CE'!$E12,'00 Aggregatore'!E:E)","v":0},{"$f":"SUMIF('00 Aggregatore'!$B:$B,'00 CE'!$E12,'00 Aggregatore'!F:F)","v":0}]
[null,"AA0100","A.1.B.1.4)  Contributi da Regione o Prov. Aut. (extra fondo) - Altro",null,"AA0100",{"$f":"SUMIF('00 Aggregatore'!$B:$B,'00 CE'!$E13,'00 Aggregatore'!E:E)","v":0},{"$f":"SUMIF('00 Aggregatore'!$B:$B,'00 CE'!$E13,'00 Aggregatore'!F:F)","v":0}]
[null,"AA0110","A.1.B.2)  Contributi da Aziende sanitarie pubbliche della Regione o Prov. Aut. (extra fondo) ","S","AA0110",{"$f":"SUM(F15:F16)","v":0},{"$f":"SUM(G15:G16)","v":0}]
[null,"AA0120","A.1.B.2.1)  Contributi da Aziende sanitarie pubbliche della Regione o Prov. Aut. (extra fondo) vincolati",null,"AA0120",{"$f":"SUMIF('00 Aggregatore'!$B:$B,'00 CE'!$E15,'00 Aggregatore'!E:E)","v":0},{"$f":"SUMIF('00 Aggregatore'!$B:$B,'00 CE'!$E15,'00 Aggregatore'!F:F)","v":0}]
[null,"AA0130","A.1.B.2.2)  Contributi da Aziende sanitarie pubbliche della Regione o Prov. Aut. (extra fondo) altro",null,"AA0130",{"$f":"SUMIF('00 Aggregatore'!$B:$B,'00 CE'!$E16,'00 Aggregatore'!E:E)","v":0},{"$f":"SUMIF('00 Aggregatore'!$B:$B,'00 CE'!$E16,'00 Aggregatore'!F:F)","v":0}]
[null,"AA0140","A.1.B.3)  Contributi da altri soggetti pubblici (extra fondo) ","S","AA0140",{"$f":"SUM(F18:F20)","v":156684.25},{"$f":"SUM(G18:G20)","v":168535.25}]
[null,"AA0150","A.1.B.3.1)  Contributi da altri soggetti pubblici (extra fondo) vincolati",null,"AA0150",{"$f":"SUMIF('00 Aggregatore'!$B:$B,'00 CE'!$E18,'00 Aggregatore'!E:E)","v":156684.25},{"$f":"SUMIF('00 Aggregatore'!$B:$B,'00 CE'!$E18,'00 Aggregatore'!F:F)","v":168535.25}]
[null,"AA0160","A.1.B.3.2)  Contributi da altri soggetti pubblici (extra fondo) L. 210/92",null,"AA0160",{"$f":"SUMIF('00 Aggregatore'!$B:$B,'00 CE'!$E19,'00 Aggregatore'!E:E)","v":0},{"$f":"SUMIF('00 Aggregatore'!$B:$B,'00 CE'!$E19,'00 Aggregatore'!F:F)","v":0}]
[null,"AA0170","A.1.B.3.3)  Contributi da altri soggetti pubblici (extra fondo) altro",null,"AA0170",{"$f":"SUMIF('00 Aggregatore'!$B:$B,'00 CE'!$E20,'00 Aggregatore'!E:E)","v":0},{"$f":"SUMIF('00 Aggregatore'!$B:$B,'00 CE'!$E20,'00 Aggregatore'!F:F)","v":0}]
[null,"AA0180","A.1.C)  Contributi c/esercizio per ricerca","S","AA0180",{"$f":"SUM(F22:F25)","v":0},{"$f":"SUM(G22:G25)","v":0}]
[null,"AA0190","A.1.C.1)  Contributi da Ministero della Salute per ricerca corrente",null,"AA0190",{"$f":"SUMIF('00 Aggregatore'!$B:$B,'00 CE'!$E22,'00 Aggregatore'!E:E)","v":0},{"$f":"SUMIF('00 Aggregatore'!$B:$B,'00 CE'!$E22,'00 Aggregatore'!F:F)","v":0}]
[null,"AA0200","A.1.C.2)  Contributi da Ministero della Salute per ricerca finalizzata",null,"AA0200",{"$f":"SUMIF('00 Aggregatore'!$B:$B,'00 CE'!$E23,'00 Aggregatore'!E:E)","v":0},{"$f":"SUMIF('00 Aggregatore'!$B:$B,'00 CE'!$E23,'00 Aggregatore'!F:F)","v":0}]
[null,"AA0210","A.1.C.3)  Contributi da Regione ed altri soggetti pubblici per ricerca",null,"AA0210",{"$f":"SUMIF('00 Aggregatore'!$B:$B,'00 CE'!$E24,'00 Aggregatore'!E:E)","v":0},{"$f":"SUMIF('00 Aggregatore'!$B:$B,'00 CE'!$E24,'00 Aggregatore'!F:F)","v":0}]
[null,"AA0220","A.1.C.4)  Contributi da privati per ricerca",null,"AA0220",{"$f":"SUMIF('00 Aggregatore'!$B:$B,'00 CE'!$E25,'00 Aggregatore'!E:E)","v":0},{"$f":"SUMIF('00 Aggregatore'!$B:$B,'00 CE'!$E25,'00 Aggregatore'!F:F)","v":0}]
[null,"AA0230","A.1.D)  Contributi c/esercizio da privati",null,"AA0230",{"$f":"SUMIF('00 Aggregatore'!$B:$B,'00 CE'!$E26,'00 Aggregatore'!E:E)","v":0},{"$f":"SUMIF('00 Aggregatore'!$B:$B,'00 CE'!$E26,'00 Aggregatore'!F:F)","v":0}]
[null,"AA0240","A.2)  Rettifica contributi c/esercizio per destinazione ad investimenti","S","AA0240",{"$f":"SUM(F28:F29)","v":-6506318.8899999997},{"$f":"SUM(G28:G29)","v":-4347846.8099999996}]
[null,"AA0250","A.2.A)  Rettifica contributi in c/esercizio per destinazione ad investimenti - da Regione o Prov. Aut. per quota F.S. regionale",null,"AA0250",{"$f":"SUMIF('00 Aggregatore'!$B:$B,'00 CE'!$E28,'00 Aggregatore'!E:E)","v":-6506318.8899999997},{"$f":"SUMIF('00 Aggregatore'!$B:$B,'00 CE'!$E28,'00 Aggregatore'!F:F)","v":-4347846.8099999996}]
[null,"AA0260","A.2.B)  Rettifica contributi in c/esercizio per destinazione ad investimenti - altri contributi",null,"AA0260",{"$f":"SUMIF('00 Aggregatore'!$B:$B,'00 CE'!$E29,'00 Aggregatore'!E:E)","v":0},{"$f":"SUMIF('00 Aggregatore'!$B:$B,'00 CE'!$E29,'00 Aggregatore'!F:F)","v":0}]
[null,"AA0270","A.3) Utilizzo fondi per quote inutilizzate contributi vincolati di esercizi precedenti","S","AA0270",{"$f":"SUM(F31:F34)","v":5773472.5599999996},{"$f":"SUM(G31:G34)","v":8070784.3200000003}]
[null,"AA0280","A.3.A)  Utilizzo fondi per quote inutilizzate contributi di esercizi precedenti da Regione o Prov. Aut. per quota F.S. regionale vincolato",null,"AA0280",{"$f":"SUMIF('00 Aggregatore'!$B:$B,'00 CE'!$E31,'00 Aggregatore'!E:E)","v":5681020.0999999996},{"$f":"SUMIF('00 Aggregatore'!$B:$B,'00 CE'!$E31,'00 Aggregatore'!F:F)","v":8070784.3200000003}]
[null,"AA0290","A.3.B) Utilizzo fondi per quote inutilizzate contributi di esercizi precedenti da soggetti pubblici (extra fondo) vincolati",null,"AA0290",{"$f":"SUMIF('00 Aggregatore'!$B:$B,'00 CE'!$E32,'00 Aggregatore'!E:E)","v":92452.46},{"$f":"SUMIF('00 Aggregatore'!$B:$B,'00 CE'!$E32,'00 Aggregatore'!F:F)","v":0}]
[null,"AA0300","A.3.C)  Utilizzo fondi per quote inutilizzate contributi di esercizi precedenti per ricerca",null,"AA0300",{"$f":"SUMIF('00 Aggregatore'!$B:$B,'00 CE'!$E33,'00 Aggregatore'!E:E)","v":0},{"$f":"SUMIF('00 Aggregatore'!$B:$B,'00 CE'!$E33,'00 Aggregatore'!F:F)","v":0}]
[null,"AA0310","A.3.D) Utilizzo fondi per quote inutilizzate contributi vincolati di esercizi precedenti da privati",null,"AA0310",{"$f":"SUMIF('00 Aggregatore'!$B:$B,'00 CE'!$E34,'00 Aggregatore'!E:E)","v":0},{"$f":"SUMIF('00 Aggregatore'!$B:$B,'00 CE'!$E34,'00 Aggregatore'!F:F)","v":0}]
[null,"AA0320","A.4)  Ricavi per prestazioni sanitarie e sociosanitarie a rilevanza sanitaria","S","AA0320",{"$f":"F36+F64+F69+F70","v":121845392.41000003},{"$f":"G36+G64+G69+G70","v":130750492}]
[null,"AA0330","A.4.A)  Ricavi per prestazioni sanitarie e sociosanitarie a rilevanza sanitaria erogate a soggetti pubblici ","S","AA0330",{"$f":"F37+F47+F48","v":102220430.00000003},{"$f":"G37+G47+G48","v":112404019.08}]
[null,"AA0340","A.4.A.1)  Ricavi per prestaz. sanitarie  e sociosanitarie a rilevanza sanitaria erogate ad Aziende sanitarie pubbliche della Regione","S","AA0340",{"$f":"SUM(F38:F46)","v":96681059.590000018},{"$f":"SUM(G38:G46)","v":99510381.00999999}]
[null,"AA0350","A.4.A.1.1) Prestazioni di ricovero",null,"AA0350",{"$f":"SUMIF('00 Aggregatore'!$B:$B,'00 CE'!$E38,'00 Aggregatore'!E:E)","v":62109937.310000002},{"$f":"SUMIF('00 Aggregatore'!$B:$B,'00 CE'!$E38,'00 Aggregatore'!F:F)","v":63932152.799999997}]
[null,"AA0360","A.4.A.1.2) Prestazioni di specialistica ambulatoriale",null,"AA0360",{"$f":"SUMIF('00 Aggregatore'!$B:$B,'00 CE'!$E39,'00 Aggregatore'!E:E)","v":8188514.2599999998},{"$f":"SUMIF('00 Aggregatore'!$B:$B,'00 CE'!$E39,'00 Aggregatore'!F:F)","v":8495470.6699999999}]
[null,"AA0370","A.4.A.1.3) Prestazioni di psichiatria residenziale e semiresidenziale",null,"AA0370",{"$f":"SUMIF('00 Aggregatore'!$B:$B,'00 CE'!$E40,'00 Aggregatore'!E:E)","v":4556497.3099999996},{"$f":"SUMIF('00 Aggregatore'!$B:$B,'00 CE'!$E40,'00 Aggregatore'!F:F)","v":4667985.8600000003}]
[null,"AA0380","A.4.A.1.4) Prestazioni di File F",null,"AA0380",{"$f":"SUMIF('00 Aggregatore'!$B:$B,'00 CE'!$E41,'00 Aggregatore'!E:E)","v":13565690.02},{"$f":"SUMIF('00 Aggregatore'!$B:$B,'00 CE'!$E41,'00 Aggregatore'!F:F)","v":13551276.25}]
[null,"AA0390","A.4.A.1.5) Prestazioni servizi MMG, PLS, Contin. assistenziale",null,"AA0390",{"$f":"SUMIF('00 Aggregatore'!$B:$B,'00 CE'!$E42,'00 Aggregatore'!E:E)","v":57455.65},{"$f":"SUMIF('00 Aggregatore'!$B:$B,'00 CE'!$E42,'00 Aggregatore'!F:F)","v":76930.02}]
[null,"AA0400","A.4.A.1.6) Prestazioni servizi farmaceutica convenzionata",null,"AA0400",{"$f":"SUMIF('00 Aggregatore'!$B:$B,'00 CE'!$E43,'00 Aggregatore'!E:E)","v":1531007.26},{"$f":"SUMIF('00 Aggregatore'!$B:$B,'00 CE'!$E43,'00 Aggregatore'!F:F)","v":1554303.34}]
[null,"AA0410","A.4.A.1.7) Prestazioni termali",null,"AA0410",{"$f":"SUMIF('00 Aggregatore'!$B:$B,'00 CE'!$E44,'00 Aggregatore'!E:E)","v":1104099.8899999999},{"$f":"SUMIF('00 Aggregatore'!$B:$B,'00 CE'!$E44,'00 Aggregatore'!F:F)","v":1071238.47}]
[null,"AA0420","A.4.A.1.8) Prestazioni trasporto ambulanze ed elisoccorso",null,"AA0420",{"$f":"SUMIF('00 Aggregatore'!$B:$B,'00 CE'!$E45,'00 Aggregatore'!E:E)","v":175653.51},{"$f":"SUMIF('00 Aggregatore'!$B:$B,'00 CE'!$E45,'00 Aggregatore'!F:F)","v":176712.63}]
[null,"AA0430","A.4.A.1.9) Altre prestazioni sanitarie e socio-sanitarie a rilevanza sanitaria ",null,"AA0430",{"$f":"SUMIF('00 Aggregatore'!$B:$B,'00 CE'!$E46,'00 Aggregatore'!E:E)","v":5392204.3799999999},{"$f":"SUMIF('00 Aggregatore'!$B:$B,'00 CE'!$E46,'00 Aggregatore'!F:F)","v":5984310.9699999997}]
[null,"AA0440","A.4.A.2)   Ricavi per prestaz. sanitarie e sociosanitarie a rilevanza sanitaria erogate ad altri soggetti pubblici ",null,"AA0440",{"$f":"SUMIF('00 Aggregatore'!$B:$B,'00 CE'!$E47,'00 Aggregatore'!E:E)","v":45364.98},{"$f":"SUMIF('00 Aggregatore'!$B:$B,'00 CE'!$E47,'00 Aggregatore'!F:F)","v":90381.5}]
[null,"AA0450","A.4.A.3)   Ricavi per prestaz. sanitarie e sociosanitarie a rilevanza sanitaria erogate a soggetti pubblici Extraregione","S","AA0450",{"$f":"SUM(F49:F60)+F63","v":5494005.4299999997},{"$f":"SUM(G49:G60)+G63","v":12803256.570000002}]
[null,"AA0460","A.4.A.3.1) Prestazioni di ricovero",null,"AA0460",{"$f":"SUMIF('00 Aggregatore'!$B:$B,'00 CE'!$E49,'00 Aggregatore'!E:E)","v":1554681.22},{"$f":"SUMIF('00 Aggregatore'!$B:$B,'00 CE'!$E49,'00 Aggregatore'!F:F)","v":7320391.0700000003}]
[null,"AA0470","A.4.A.3.2) Prestazioni ambulatoriali",null,"AA0470",{"$f":"SUMIF('00 Aggregatore'!$B:$B,'00 CE'!$E50,'00 Aggregatore'!E:E)","v":851774.85},{"$f":"SUMIF('00 Aggregatore'!$B:$B,'00 CE'!$E50,'00 Aggregatore'!F:F)","v":1477229.91}]
[null,"AA0480","A.4.A.3.3) Prestazioni di psichiatria non soggetta a compensazione (resid. e semiresid.)",null,"AA0480",{"$f":"SUMIF('00 Aggregatore'!$B:$B,'00 CE'!$E51,'00 Aggregatore'!E:E)","v":0},{"$f":"SUMIF('00 Aggregatore'!$B:$B,'00 CE'!$E51,'00 Aggregatore'!F:F)","v":0}]
[null,"AA0490","A.4.A.3.4) Prestazioni di File F",null,"AA0490",{"$f":"SUMIF('00 Aggregatore'!$B:$B,'00 CE'!$E52,'00 Aggregatore'!E:E)","v":1604980.14},{"$f":"SUMIF('00 Aggregatore'!$B:$B,'00 CE'!$E52,'00 Aggregatore'!F:F)","v":2471453.08}]
[null,"AA0500","A.4.A.3.5) Prestazioni servizi MMG, PLS, Contin. assistenziale Extraregione",null,"AA0500",{"$f":"SUMIF('00 Aggregatore'!$B:$B,'00 CE'!$E53,'00 Aggregatore'!E:E)","v":119388.84},{"$f":"SUMIF('00 Aggregatore'!$B:$B,'00 CE'!$E53,'00 Aggregatore'!F:F)","v":56122.64}]
[null,"AA0510","A.4.A.3.6) Prestazioni servizi farmaceutica convenzionata Extraregione",null,"AA0510",{"$f":"SUMIF('00 Aggregatore'!$B:$B,'00 CE'!$E54,'00 Aggregatore'!E:E)","v":502038.11},{"$f":"SUMIF('00 Aggregatore'!$B:$B,'00 CE'!$E54,'00 Aggregatore'!F:F)","v":506661.23}]
[null,"AA0520","A.4.A.3.7) Prestazioni termali Extraregione",null,"AA0520",{"$f":"SUMIF('00 Aggregatore'!$B:$B,'00 CE'!$E55,'00 Aggregatore'!E:E)","v":172275.4},{"$f":"SUMIF('00 Aggregatore'!$B:$B,'00 CE'!$E55,'00 Aggregatore'!F:F)","v":180073.68}]
[null,"AA0530","A.4.A.3.8) Prestazioni trasporto ambulanze ed elisoccorso Extraregione",null,"AA0530",{"$f":"SUMIF('00 Aggregatore'!$B:$B,'00 CE'!$E56,'00 Aggregatore'!E:E)","v":512404.02},{"$f":"SUMIF('00 Aggregatore'!$B:$B,'00 CE'!$E56,'00 Aggregatore'!F:F)","v":469730.81}]
[null,"AA0540","A.4.A.3.9) Altre prestazioni sanitarie e sociosanitarie a rilevanza sanitaria Extraregione",null,"AA0540",{"$f":"SUMIF('00 Aggregatore'!$B:$B,'00 CE'!$E57,'00 Aggregatore'!E:E)","v":0},{"$f":"SUMIF('00 Aggregatore'!$B:$B,'00 CE'!$E57,'00 Aggregatore'!F:F)","v":0}]
[null,"AA0550","A.4.A.3.10) Ricavi per cessione di emocomponenti e cellule staminali Extraregione",null,"AA0550",{"$f":"SUMIF('00 Aggregatore'!$B:$B,'00 CE'!$E58,'00 Aggregatore'!E:E)","v":174766.05},{"$f":"SUMIF('00 Aggregatore'!$B:$B,'00 CE'!$E58,'00 Aggregatore'!F:F)","v":0}]
[null,"AA0560","A.4.A.3.11) Ricavi per differenziale tariffe TUC",null,"AA0560",{"$f":"SUMIF('00 Aggregatore'!$B:$B,'00 CE'!$E59,'00 Aggregatore'!E:E)","v":0},{"$f":"SUMIF('00 Aggregatore'!$B:$B,'00 CE'!$E59,'00 Aggregatore'!F:F)","v":0}]
[null,"AA0570","A.4.A.3.12) Altre prestazioni sanitarie e sociosanitarie a rilevanza sanitaria non soggette a compensazione Extraregione","S","AA0570",{"$f":"SUM(F61:F62)","v":1696.8},{"$f":"SUM(G61:G62)","v":2626.39}]
[null,"AA0580","A.4.A.3.12.A) Prestazioni di assistenza riabilitativa non soggette a compensazione Extraregione",null,"AA0580",{"$f":"SUMIF('00 Aggregatore'!$B:$B,'00 CE'!$E61,'00 Aggregatore'!E:E)","v":0},{"$f":"SUMIF('00 Aggregatore'!$B:$B,'00 CE'!$E61,'00 Aggregatore'!F:F)","v":0}]
[null,"AA0590","A.4.A.3.12.B) Altre prestazioni sanitarie e socio-sanitarie a rilevanza sanitaria non soggette a compensazione Extraregione",null,"AA0590",{"$f":"SUMIF('00 Aggregatore'!$B:$B,'00 CE'!$E62,'00 Aggregatore'!E:E)","v":1696.8},{"$f":"SUMIF('00 Aggregatore'!$B:$B,'00 CE'!$E62,'00 Aggregatore'!F:F)","v":2626.39}]
[null,"AA0600","A.4.A.3.13) Altre prestazioni sanitarie a rilevanza sanitaria - Mobilità attiva Internazionale",null,"AA0600",{"$f":"SUMIF('00 Aggregatore'!$B:$B,'00 CE'!$E63,'00 Aggregatore'!E:E)","v":0},{"$f":"SUMIF('00 Aggregatore'!$B:$B,'00 CE'!$E63,'00 Aggregatore'!F:F)","v":318967.76}]
[null,"AA0610","A.4.B)  Ricavi per prestazioni sanitarie e sociosanitarie a rilevanza sanitaria erogate da privati v/residenti Extraregione in compensazione (mobilità attiva)","S","AA0610",{"$f":"SUM(F65:F68)","v":12136123.77},{"$f":"SUM(G65:G68)","v":10487489.539999999}]
[null,"AA0620","A.4.B.1)  Prestazioni di ricovero da priv. Extraregione in compensazione (mobilità attiva)",null,"AA0620",{"$f":"SUMIF('00 Aggregatore'!$B:$B,'00 CE'!$E65,'00 Aggregatore'!E:E)","v":11917704.07},{"$f":"SUMIF('00 Aggregatore'!$B:$B,'00 CE'!$E65,'00 Aggregatore'!F:F)","v":10285883.1}]
[null,"AA0630","A.4.B.2)  Prestazioni ambulatoriali da priv. Extraregione in compensazione  (mobilità attiva)",null,"AA0630",{"$f":"SUMIF('00 Aggregatore'!$B:$B,'00 CE'!$E66,'00 Aggregatore'!E:E)","v":218419.7},{"$f":"SUMIF('00 Aggregatore'!$B:$B,'00 CE'!$E66,'00 Aggregatore'!F:F)","v":201606.44}]
[null,"AA0640","A.4.B.3)  Prestazioni di File F da priv. Extraregione in compensazione (mobilità attiva)",null,"AA0640",{"$f":"SUMIF('00 Aggregatore'!$B:$B,'00 CE'!$E67,'00 Aggregatore'!E:E)","v":0},{"$f":"SUMIF('00 Aggregatore'!$B:$B,'00 CE'!$E67,'00 Aggregatore'!F:F)","v":0}]
[null,"AA0650","A.4.B.4)  Altre prestazioni sanitarie e sociosanitarie a rilevanza sanitaria erogate da privati v/residenti Extraregione in compensazione (mobilità attiva)",null,"AA0650",{"$f":"SUMIF('00 Aggregatore'!$B:$B,'00 CE'!$E68,'00 Aggregatore'!E:E)","v":0},{"$f":"SUMIF('00 Aggregatore'!$B:$B,'00 CE'!$E68,'00 Aggregatore'!F:F)","v":0}]
[null,"AA0660","A.4.C)  Ricavi per prestazioni sanitarie e sociosanitarie a rilevanza sanitaria erogate a privati ",null,"AA0660",{"$f":"SUMIF('00 Aggregatore'!$B:$B,'00 CE'!$E69,'00 Aggregatore'!E:E)","v":3569406.3100000005},{"$f":"SUMIF('00 Aggregatore'!$B:$B,'00 CE'!$E69,'00 Aggregatore'!F:F)","v":3620504.31}]
[null,"AA0670","A.4.D)  Ricavi per prestazioni sanitarie erogate in regime di intramoenia","S","AA0670",{"$f":"SUM(F71:F77)","v":3919432.33},{"$f":"SUM(G71:G77)","v":4238479.07}]
[null,"AA0680","A.4.D.1)  Ricavi per prestazioni sanitarie intramoenia - Area ospedaliera",null,"AA0680",{"$f":"SUMIF('00 Aggregatore'!$B:$B,'00 CE'!$E71,'00 Aggregatore'!E:E)","v":50045.82},{"$f":"SUMIF('00 Aggregatore'!$B:$B,'00 CE'!$E71,'00 Aggregatore'!F:F)","v":80436.56}]
[null,"AA0690","A.4.D.2)  Ricavi per prestazioni sanitarie intramoenia - Area specialistica",null,"AA0690",{"$f":"SUMIF('00 Aggregatore'!$B:$B,'00 CE'!$E72,'00 Aggregatore'!E:E)","v":3252006},{"$f":"SUMIF('00 Aggregatore'!$B:$B,'00 CE'!$E72,'00 Aggregatore'!F:F)","v":3326104}]
[null,"AA0700","A.4.D.3)  Ricavi per prestazioni sanitarie intramoenia - Area sanità pubblica",null,"AA0700",{"$f":"SUMIF('00 Aggregatore'!$B:$B,'00 CE'!$E73,'00 Aggregatore'!E:E)","v":22414.54},{"$f":"SUMIF('00 Aggregatore'!$B:$B,'00 CE'!$E73,'00 Aggregatore'!F:F)","v":17534.57}]
[null,"AA0710","A.4.D.4)  Ricavi per prestazioni sanitarie intramoenia - Consulenze (ex art. 55 c.1 lett. c), d) ed ex art. 57-58)",null,"AA0710",{"$f":"SUMIF('00 Aggregatore'!$B:$B,'00 CE'!$E74,'00 Aggregatore'!E:E)","v":478823.7},{"$f":"SUMIF('00 Aggregatore'!$B:$B,'00 CE'!$E74,'00 Aggregatore'!F:F)","v":677848.85}]
[null,"AA0720","A.4.D.5)  Ricavi per prestazioni sanitarie intramoenia - Consulenze (ex art. 55 c.1 lett. c), d) ed ex art. 57-58) (Aziende sanitarie pubbliche della Regione)",null,"AA0720",{"$f":"SUMIF('00 Aggregatore'!$B:$B,'00 CE'!$E75,'00 Aggregatore'!E:E)","v":0},{"$f":"SUMIF('00 Aggregatore'!$B:$B,'00 CE'!$E75,'00 Aggregatore'!F:F)","v":0}]
[null,"AA0730","A.4.D.6)  Ricavi per prestazioni sanitarie intramoenia - Altro",null,"AA0730",{"$f":"SUMIF('00 Aggregatore'!$B:$B,'00 CE'!$E76,'00 Aggregatore'!E:E)","v":97870.17},{"$f":"SUMIF('00 Aggregatore'!$B:$B,'00 CE'!$E76,'00 Aggregatore'!F:F)","v":130775.39}]
[null,"AA0740","A.4.D.7)  Ricavi per prestazioni sanitarie intramoenia - Altro (Aziende sanitarie pubbliche della Regione)",null,"AA0740",{"$f":"SUMIF('00 Aggregatore'!$B:$B,'00 CE'!$E77,'00 Aggregatore'!E:E)","v":18272.099999999999},{"$f":"SUMIF('00 Aggregatore'!$B:$B,'00 CE'!$E77,'00 Aggregatore'!F:F)","v":5779.7}]
[null,"AA0750","A.5) Concorsi, recuperi e rimborsi","S","AA0750",{"$f":"F79+F80+F83+F87+F91","v":4898267.1500000004},{"$f":"G79+G80+G83+G87+G91","v":3858742.5700000003}]
[null,"AA0760","A.5.A) Rimborsi assicurativi",null,"AA0760",{"$f":"SUMIF('00 Aggregatore'!$B:$B,'00 CE'!$E79,'00 Aggregatore'!E:E)","v":166973.67000000001},{"$f":"SUMIF('00 Aggregatore'!$B:$B,'00 CE'!$E79,'00 Aggregatore'!F:F)","v":151672.57999999999}]
[null,"AA0770","A.5.B) Concorsi, recuperi e rimborsi da Regione","S","AA0770",{"$f":"SUM(F81:F82)","v":0},{"$f":"SUM(G81:G82)","v":0}]
[null,"AA0780","A.5.B.1) Rimborso degli oneri stipendiali del personale dell'azienda in posizione di comando presso la Regione",null,"AA0780",{"$f":"SUMIF('00 Aggregatore'!$B:$B,'00 CE'!$E81,'00 Aggregatore'!E:E)","v":0},{"$f":"SUMIF('00 Aggregatore'!$B:$B,'00 CE'!$E81,'00 Aggregatore'!F:F)","v":0}]
[null,"AA0790","A.5.B.2) Altri concorsi, recuperi e rimborsi da parte della Regione",null,"AA0790",{"$f":"SUMIF('00 Aggregatore'!$B:$B,'00 CE'!$E82,'00 Aggregatore'!E:E)","v":0},{"$f":"SUMIF('00 Aggregatore'!$B:$B,'00 CE'!$E82,'00 Aggregatore'!F:F)","v":0}]
[null,"AA0800","A.5.C) Concorsi, recuperi e rimborsi da Aziende sanitarie pubbliche della Regione","S","AA0800",{"$f":"SUM(F84:F86)","v":150230.1},{"$f":"SUM(G84:G86)","v":203850.7}]
[null,"AA0810","A.5.C.1) Rimborso degli oneri stipendiali del personale dipendente dell'azienda in posizione di comando presso Aziende sanitarie pubbliche della Regione",null,"AA0810",{"$f":"SUMIF('00 Aggregatore'!$B:$B,'00 CE'!$E84,'00 Aggregatore'!E:E)","v":14346.46},{"$f":"SUMIF('00 Aggregatore'!$B:$B,'00 CE'!$E84,'00 Aggregatore'!F:F)","v":23253.72}]
[null,"AA0820","A.5.C.2) Rimborsi per acquisto beni da parte di Aziende sanitarie pubbliche della Regione",null,"AA0820",{"$f":"SUMIF('00 Aggregatore'!$B:$B,'00 CE'!$E85,'00 Aggregatore'!E:E)","v":0},{"$f":"SUMIF('00 Aggregatore'!$B:$B,'00 CE'!$E85,'00 Aggregatore'!F:F)","v":0}]
[null,"AA0830","A.5.C.3) Altri concorsi, recuperi e rimborsi da parte di Aziende sanitarie pubbliche della Regione",null,"AA0830",{"$f":"SUMIF('00 Aggregatore'!$B:$B,'00 CE'!$E86,'00 Aggregatore'!E:E)","v":135883.64000000001},{"$f":"SUMIF('00 Aggregatore'!$B:$B,'00 CE'!$E86,'00 Aggregatore'!F:F)","v":180596.98}]
[null,"AA0840","A.5.D) Concorsi, recuperi e rimborsi da altri soggetti pubblici","S","AA0840",{"$f":"SUM(F88:F90)","v":287130.67},{"$f":"SUM(G88:G90)","v":253111.86}]
[null,"AA0850","A.5.D.1) Rimborso degli oneri stipendiali del personale dipendente dell'azienda in posizione di comando presso altri soggetti pubblici",null,"AA0850",{"$f":"SUMIF('00 Aggregatore'!$B:$B,'00 CE'!$E88,'00 Aggregatore'!E:E)","v":114750.81},{"$f":"SUMIF('00 Aggregatore'!$B:$B,'00 CE'!$E88,'00 Aggregatore'!F:F)","v":150326.43}]
[null,"AA0860","A.5.D.2) Rimborsi per acquisto beni da parte di altri soggetti pubblici",null,"AA0860",{"$f":"SUMIF('00 Aggregatore'!$B:$B,'00 CE'!$E89,'00 Aggregatore'!E:E)","v":14709.64},{"$f":"SUMIF('00 Aggregatore'!$B:$B,'00 CE'!$E89,'00 Aggregatore'!F:F)","v":8374.7800000000007}]
[null,"AA0870","A.5.D.3) Altri concorsi, recuperi e rimborsi da parte di altri soggetti pubblici",null,"AA0870",{"$f":"SUMIF('00 Aggregatore'!$B:$B,'00 CE'!$E90,'00 Aggregatore'!E:E)","v":157670.22},{"$f":"SUMIF('00 Aggregatore'!$B:$B,'00 CE'!$E90,'00 Aggregatore'!F:F)","v":94410.650000000009}]
[null,"AA0880","A.5.E) Concorsi, recuperi e rimborsi da privati","S","AA0880",{"$f":"F92+F96","v":4293932.71},{"$f":"G92+G96","v":3250107.43}]
[null,"AA0890","A.5.E.1) Rimborso da aziende farmaceutiche per Pay back","S","AA0890",{"$f":"SUM(F93:F95)","v":3426952.4},{"$f":"SUM(G93:G95)","v":2615698.91}]
[null,"AA0900","A.5.E.1.1) Pay-back per il superamento del tetto della spesa farmaceutica territoriale",null,"AA0900",{"$f":"SUMIF('00 Aggregatore'!$B:$B,'00 CE'!$E93,'00 Aggregatore'!E:E)","v":0},{"$f":"SUMIF('00 Aggregatore'!$B:$B,'00 CE'!$E93,'00 Aggregatore'!F:F)","v":0}]
[null,"AA0910","A.5.E.1.2) Pay-back per superamento del tetto della spesa farmaceutica ospedaliera",null,"AA0910",{"$f":"SUMIF('00 Aggregatore'!$B:$B,'00 CE'!$E94,'00 Aggregatore'!E:E)","v":20},{"$f":"SUMIF('00 Aggregatore'!$B:$B,'00 CE'!$E94,'00 Aggregatore'!F:F)","v":0}]
[null,"AA0920","A.5.E.1.3) Ulteriore Pay-back",null,"AA0920",{"$f":"SUMIF('00 Aggregatore'!$B:$B,'00 CE'!$E95,'00 Aggregatore'!E:E)","v":3426932.4},{"$f":"SUMIF('00 Aggregatore'!$B:$B,'00 CE'!$E95,'00 Aggregatore'!F:F)","v":2615698.91}]
[null,"AA0930","A.5.E.2) Altri concorsi, recuperi e rimborsi da privati",null,"AA0930",{"$f":"SUMIF('00 Aggregatore'!$B:$B,'00 CE'!$E96,'00 Aggregatore'!E:E)","v":866980.31},{"$f":"SUMIF('00 Aggregatore'!$B:$B,'00 CE'!$E96,'00 Aggregatore'!F:F)","v":634408.52}]
[null,"AA0940","A.6)  Compartecipazione alla spesa per prestazioni sanitarie (Ticket)","S","AA0940",{"$f":"SUM(F98:F100)","v":6745092.0800000001},{"$f":"SUM(G98:G100)","v":6929806.9500000002}]
[null,"AA0950","A.6.A)  Compartecipazione alla spesa per prestazioni sanitarie - Ticket sulle prestazioni di specialistica ambulatoriale",null,"AA0950",{"$f":"SUMIF('00 Aggregatore'!$B:$B,'00 CE'!$E98,'00 Aggregatore'!E:E)","v":6414769.3200000003},{"$f":"SUMIF('00 Aggregatore'!$B:$B,'00 CE'!$E98,'00 Aggregatore'!F:F)","v":6543145.3100000005}]
[null,"AA0960","A.6.B)  Compartecipazione alla spesa per prestazioni sanitarie - Ticket sul pronto soccorso",null,"AA0960",{"$f":"SUMIF('00 Aggregatore'!$B:$B,'00 CE'!$E99,'00 Aggregatore'!E:E)","v":330322.76},{"$f":"SUMIF('00 Aggregatore'!$B:$B,'00 CE'!$E99,'00 Aggregatore'!F:F)","v":386661.64}]
[null,"AA0970","A.6.C)  Compartecipazione alla spesa per prestazioni sanitarie (Ticket) - Altro",null,"AA0970",{"$f":"SUMIF('00 Aggregatore'!$B:$B,'00 CE'!$E100,'00 Aggregatore'!E:E)","v":0},{"$f":"SUMIF('00 Aggregatore'!$B:$B,'00 CE'!$E100,'00 Aggregatore'!F:F)","v":0}]
[null,"AA0980","A.7)  Quota contributi c/capitale imputata all'esercizio","S","AA0980",{"$f":"SUM(F102:F107)","v":9824993.1499999985},{"$f":"SUM(G102:G107)","v":10491674.920000002}]
[null,"AA0990","A.7.A) Quota imputata all'esercizio dei finanziamenti per investimenti dallo Stato",null,"AA0990",{"$f":"SUMIF('00 Aggregatore'!$B:$B,'00 CE'!$E102,'00 Aggregatore'!E:E)","v":48286.07},{"$f":"SUMIF('00 Aggregatore'!$B:$B,'00 CE'!$E102,'00 Aggregatore'!F:F)","v":54754.03}]
[null,"AA1000","A.7.B)  Quota imputata all'esercizio dei finanziamenti per investimenti da Regione ",null,"AA1000",{"$f":"SUMIF('00 Aggregatore'!$B:$B,'00 CE'!$E103,'00 Aggregatore'!E:E)","v":1468544.84},{"$f":"SUMIF('00 Aggregatore'!$B:$B,'00 CE'!$E103,'00 Aggregatore'!F:F)","v":1674245.68}]
[null,"AA1010","A.7.C)  Quota imputata all'esercizio dei finanziamenti per beni di prima dotazione",null,"AA1010",{"$f":"SUMIF('00 Aggregatore'!$B:$B,'00 CE'!$E104,'00 Aggregatore'!E:E)","v":3577467.93},{"$f":"SUMIF('00 Aggregatore'!$B:$B,'00 CE'!$E104,'00 Aggregatore'!F:F)","v":3577467.93}]
[null,"AA1020","A.7.D) Quota imputata all'esercizio dei contributi in c/ esercizio FSR destinati ad investimenti",null,"AA1020",{"$f":"SUMIF('00 Aggregatore'!$B:$B,'00 CE'!$E105,'00 Aggregatore'!E:E)","v":4730694.3099999996},{"$f":"SUMIF('00 Aggregatore'!$B:$B,'00 CE'!$E105,'00 Aggregatore'!F:F)","v":5185207.28}]
[null,"AA1030","A.7.E) Quota imputata all'esercizio degli altri contributi in c/ esercizio destinati ad investimenti",null,"AA1030",{"$f":"SUMIF('00 Aggregatore'!$B:$B,'00 CE'!$E106,'00 Aggregatore'!E:E)","v":0},{"$f":"SUMIF('00 Aggregatore'!$B:$B,'00 CE'!$E106,'00 Aggregatore'!F:F)","v":0}]
[null,"AA1040","A.7.F) Quota imputata all'esercizio di altre poste del patrimonio netto",null,"AA1040",{"$f":"SUMIF('00 Aggregatore'!$B:$B,'00 CE'!$E107,'00 Aggregatore'!E:E)","v":0},{"$f":"SUMIF('00 Aggregatore'!$B:$B,'00 CE'!$E107,'00 Aggregatore'!F:F)","v":0}]
[null,"AA1050","A.8)  Incrementi delle immobilizzazioni per lavori interni",null,"AA1050",{"$f":"SUMIF('00 Aggregatore'!$B:$B,'00 CE'!$E108,'00 Aggregatore'!E:E)","v":0},{"$f":"SUMIF('00 Aggregatore'!$B:$B,'00 CE'!$E108,'00 Aggregatore'!F:F)","v":0}]
[null,"AA1060","A.9) Altri ricavi e proventi","S","AA1060",{"$f":"SUM(F110:F112)","v":622301.4},{"$f":"SUM(G110:G112)","v":551446.96}]
[null,"AA1070","A.9.A) Ricavi per prestazioni non sanitarie",null,"AA1070",{"$f":"SUMIF('00 Aggregatore'!$B:$B,'00 CE'!$E110,'00 Aggregatore'!E:E)","v":3023.66},{"$f":"SUMIF('00 Aggregatore'!$B:$B,'00 CE'!$E110,'00 Aggregatore'!F:F)","v":1738.6}]
[null,"AA1080","A.9.B) Fitti attivi ed altri proventi da attività immobiliari",null,"AA1080",{"$f":"SUMIF('00 Aggregatore'!$B:$B,'00 CE'!$E111,'00 Aggregatore'!E:E)","v":221560.64},{"$f":"SUMIF('00 Aggregatore'!$B:$B,'00 CE'!$E111,'00 Aggregatore'!F:F)","v":186882.15}]
[null,"AA1090","A.9.C) Altri proventi diversi",null,"AA1090",{"$f":"SUMIF('00 Aggregatore'!$B:$B,'00 CE'!$E112,'00 Aggregatore'!E:E)","v":397717.1},{"$f":"SUMIF('00 Aggregatore'!$B:$B,'00 CE'!$E112,'00 Aggregatore'!F:F)","v":362826.20999999996}]
[null,"AZ9999","Totale valore della produzione (A)","S","AZ9999",{"$f":"F4+F27+F30+F35+F78+F97+F101+F108+F109","v":706064340.41000009},{"$f":"G4+G27+G30+G35+G78+G97+G101+G108+G109","v":726128606.73000026}]
[null,null,"B)  Costi della produzione"]
[null,"BA0010","B.1)  Acquisti di beni","S","BA0010",{"$f":"F116+F135","v":117076514.19000003},{"$f":"G116+G135","v":132089475.31999998}]
[null,"BA0020","B.1.A)  Acquisti di beni sanitari","S","BA0020",{"$f":"F117+F121+F125+SUM(F129:F134)","v":116128391.57000002},{"$f":"G117+G121+G125+SUM(G129:G134)","v":131089732.62999998}]
[null,"BA0030","B.1.A.1)  Prodotti farmaceutici ed emoderivati","S","BA0030",{"$f":"SUM(F118:F120)","v":69958395.310000017},{"$f":"SUM(G118:G120)","v":83288901.429999992}]
[null,"BA0040","B.1.A.1.1) Medicinali con AIC, ad eccezione di vaccini ed emoderivati di produzione regionale",null,"BA0040",{"$f":"SUMIF('00 Aggregatore'!$B:$B,'00 CE'!$E118,'00 Aggregatore'!E:E)","v":69235809.470000014},{"$f":"SUMIF('00 Aggregatore'!$B:$B,'00 CE'!$E118,'00 Aggregatore'!F:F)","v":82536637.089999989}]
[null,"BA0050","B.1.A.1.2) Medicinali senza AIC",null,"BA0050",{"$f":"SUMIF('00 Aggregatore'!$B:$B,'00 CE'!$E119,'00 Aggregatore'!E:E)","v":722585.84},{"$f":"SUMIF('00 Aggregatore'!$B:$B,'00 CE'!$E119,'00 Aggregatore'!F:F)","v":752264.34}]
[null,"BA0060","B.1.A.1.3) Emoderivati di produzione regionale",null,"BA0060",{"$f":"SUMIF('00 Aggregatore'!$B:$B,'00 CE'!$E120,'00 Aggregatore'!E:E)","v":0},{"$f":"SUMIF('00 Aggregatore'!$B:$B,'00 CE'!$E120,'00 Aggregatore'!F:F)","v":0}]
[null,"BA0070","B.1.A.2)  Sangue ed emocomponenti","S","BA0070",{"$f":"SUM(F122:F124)","v":187348.99},{"$f":"SUM(G122:G124)","v":23080.75}]
[null,"BA0080","B.1.A.2.1) da pubblico (Aziende sanitarie pubbliche della Regione) – Mobilità intraregionale",null,"BA0080",{"$f":"SUMIF('00 Aggregatore'!$B:$B,'00 CE'!$E122,'00 Aggregatore'!E:E)","v":0},{"$f":"SUMIF('00 Aggregatore'!$B:$B,'00 CE'!$E122,'00 Aggregatore'!F:F)","v":0}]
[null,"BA0090","B.1.A.2.2) da pubblico (Aziende sanitarie pubbliche extra Regione) – Mobilità extraregionale",null,"BA0090",{"$f":"SUMIF('00 Aggregatore'!$B:$B,'00 CE'!$E123,'00 Aggregatore'!E:E)","v":187348.99},{"$f":"SUMIF('00 Aggregatore'!$B:$B,'00 CE'!$E123,'00 Aggregatore'!F:F)","v":23080.75}]
[null,"BA0100","B.1.A.2.3) da altri soggetti",null,"BA0100",{"$f":"SUMIF('00 Aggregatore'!$B:$B,'00 CE'!$E124,'00 Aggregatore'!E:E)","v":0},{"$f":"SUMIF('00 Aggregatore'!$B:$B,'00 CE'!$E124,'00 Aggregatore'!F:F)","v":0}]
[null,"BA0210","B.1.A.3) Dispositivi medici","S","BA0210",{"$f":"SUM(F126:F128)","v":41189711.570000008},{"$f":"SUM(G126:G128)","v":42871861.68}]
[null,"BA0220","B.1.A.3.1)  Dispositivi medici ",null,"BA0220",{"$f":"SUMIF('00 Aggregatore'!$B:$B,'00 CE'!$E126,'00 Aggregatore'!E:E)","v":25764695.790000003},{"$f":"SUMIF('00 Aggregatore'!$B:$B,'00 CE'!$E126,'00 Aggregatore'!F:F)","v":27013313.950000003}]
[null,"BA0230","B.1.A.3.2)  Dispositivi medici impiantabili attivi",null,"BA0230",{"$f":"SUMIF('00 Aggregatore'!$B:$B,'00 CE'!$E127,'00 Aggregatore'!E:E)","v":3456008.28},{"$f":"SUMIF('00 Aggregatore'!$B:$B,'00 CE'!$E127,'00 Aggregatore'!F:F)","v":3071999.01}]
[null,"BA0240","B.1.A.3.3)  Dispositivi medico diagnostici in vitro (IVD)",null,"BA0240",{"$f":"SUMIF('00 Aggregatore'!$B:$B,'00 CE'!$E128,'00 Aggregatore'!E:E)","v":11969007.5},{"$f":"SUMIF('00 Aggregatore'!$B:$B,'00 CE'!$E128,'00 Aggregatore'!F:F)","v":12786548.720000001}]
[null,"BA0250","B.1.A.4)  Prodotti dietetici",null,"BA0250",{"$f":"SUMIF('00 Aggregatore'!$B:$B,'00 CE'!$E129,'00 Aggregatore'!E:E)","v":469645.74000000005},{"$f":"SUMIF('00 Aggregatore'!$B:$B,'00 CE'!$E129,'00 Aggregatore'!F:F)","v":468960.66}]
[null,"BA0260","B.1.A.5)  Materiali per la profilassi (vaccini)",null,"BA0260",{"$f":"SUMIF('00 Aggregatore'!$B:$B,'00 CE'!$E130,'00 Aggregatore'!E:E)","v":2380862.56},{"$f":"SUMIF('00 Aggregatore'!$B:$B,'00 CE'!$E130,'00 Aggregatore'!F:F)","v":2222785.11}]
[null,"BA0270","B.1.A.6)  Prodotti chimici",null,"BA0270",{"$f":"SUMIF('00 Aggregatore'!$B:$B,'00 CE'!$E131,'00 Aggregatore'!E:E)","v":0},{"$f":"SUMIF('00 Aggregatore'!$B:$B,'00 CE'!$E131,'00 Aggregatore'!F:F)","v":0}]
[null,"BA0280","B.1.A.7)  Materiali e prodotti per uso veterinario",null,"BA0280",{"$f":"SUMIF('00 Aggregatore'!$B:$B,'00 CE'!$E132,'00 Aggregatore'!E:E)","v":7852.7999999999993},{"$f":"SUMIF('00 Aggregatore'!$B:$B,'00 CE'!$E132,'00 Aggregatore'!F:F)","v":20636.41}]
[null,"BA0290","B.1.A.8)  Altri beni e prodotti sanitari",null,"BA0290",{"$f":"SUMIF('00 Aggregatore'!$B:$B,'00 CE'!$E133,'00 Aggregatore'!E:E)","v":1934574.6},{"$f":"SUMIF('00 Aggregatore'!$B:$B,'00 CE'!$E133,'00 Aggregatore'!F:F)","v":2193506.59}]
[null,"BA0300","B.1.A.9)  Beni e prodotti sanitari da Aziende sanitarie pubbliche della Regione",null,"BA0300",{"$f":"SUMIF('00 Aggregatore'!$B:$B,'00 CE'!$E134,'00 Aggregatore'!E:E)","v":0},{"$f":"SUMIF('00 Aggregatore'!$B:$B,'00 CE'!$E134,'00 Aggregatore'!F:F)","v":0}]
[null,"BA0310","B.1.B)  Acquisti di beni non sanitari","S","BA0310",{"$f":"SUM(F136:F142)","v":948122.62000000011},{"$f":"SUM(G136:G142)","v":999742.69}]
[null,"BA0320","B.1.B.1)  Prodotti alimentari",null,"BA0320",{"$f":"SUMIF('00 Aggregatore'!$B:$B,'00 CE'!$E136,'00 Aggregatore'!E:E)","v":250.58},{"$f":"SUMIF('00 Aggregatore'!$B:$B,'00 CE'!$E136,'00 Aggregatore'!F:F)","v":83.52}]
[null,"BA0330","B.1.B.2)  Materiali di guardaroba, di pulizia e di convivenza in genere",null,"BA0330",{"$f":"SUMIF('00 Aggregatore'!$B:$B,'00 CE'!$E137,'00 Aggregatore'!E:E)","v":41796.379999999997},{"$f":"SUMIF('00 Aggregatore'!$B:$B,'00 CE'!$E137,'00 Aggregatore'!F:F)","v":64306.42}]
[null,"BA0340","B.1.B.3)  Combustibili, carburanti e lubrificanti",null,"BA0340",{"$f":"SUMIF('00 Aggregatore'!$B:$B,'00 CE'!$E138,'00 Aggregatore'!E:E)","v":135937.70000000001},{"$f":"SUMIF('00 Aggregatore'!$B:$B,'00 CE'!$E138,'00 Aggregatore'!F:F)","v":172419.52}]
[null,"BA0350","B.1.B.4)  Supporti informatici e cancelleria",null,"BA0350",{"$f":"SUMIF('00 Aggregatore'!$B:$B,'00 CE'!$E139,'00 Aggregatore'!E:E)","v":513727.87},{"$f":"SUMIF('00 Aggregatore'!$B:$B,'00 CE'!$E139,'00 Aggregatore'!F:F)","v":477974.89999999997}]
[null,"BA0360","B.1.B.5)  Materiale per la manutenzione",null,"BA0360",{"$f":"SUMIF('00 Aggregatore'!$B:$B,'00 CE'!$E140,'00 Aggregatore'!E:E)","v":207783.52999999997},{"$f":"SUMIF('00 Aggregatore'!$B:$B,'00 CE'!$E140,'00 Aggregatore'!F:F)","v":239884.37}]
[null,"BA0370","B.1.B.6)  Altri beni e prodotti non sanitari",null,"BA0370",{"$f":"SUMIF('00 Aggregatore'!$B:$B,'00 CE'!$E141,'00 Aggregatore'!E:E)","v":48626.559999999998},{"$f":"SUMIF('00 Aggregatore'!$B:$B,'00 CE'!$E141,'00 Aggregatore'!F:F)","v":45073.96}]
[null,"BA0380","B.1.B.7)  Beni e prodotti non sanitari da Aziende sanitarie pubbliche della Regione",null,"BA0380",{"$f":"SUMIF('00 Aggregatore'!$B:$B,'00 CE'!$E142,'00 Aggregatore'!E:E)","v":0},{"$f":"SUMIF('00 Aggregatore'!$B:$B,'00 CE'!$E142,'00 Aggregatore'!F:F)","v":0}]
[null,"BA0390","B.2)  Acquisti di servizi","S","BA0390",{"$f":"F144+F260","v":368344821.86000001},{"$f":"G144+G260","v":368048523.80999982}]
[null,"BA0400","B.2.A)   Acquisti servizi sanitari","S","BA0400",{"$f":"F145+F153+F157+F168+F174+F179+F184+F194+F200+F207+F213+F218+F224+F232+F239+F253+F259","v":331559072.38},{"$f":"G145+G153+G157+G168+G174+G179+G184+G194+G200+G207+G213+G218+G224+G232+G239+G253+G259","v":331170827.86999983}]
[null,"BA0410","B.2.A.1)   Acquisti servizi sanitari per medicina di base","S","BA0410",{"$f":"F146+F151+F152","v":35655655.119999997},{"$f":"G146+G151+G152","v":35909283.82}]
[null,"BA0420","B.2.A.1.1) - da convenzione","S","BA0420",{"$f":"SUM(F147:F150)","v":35435849.350000001},{"$f":"SUM(G147:G150)","v":35653505.32}]
[null,"BA0430","B.2.A.1.1.A) Costi per assistenza MMG",null,"BA0430",{"$f":"SUMIF('00 Aggregatore'!$B:$B,'00 CE'!$E147,'00 Aggregatore'!E:E)","v":24328709.329999998},{"$f":"SUMIF('00 Aggregatore'!$B:$B,'00 CE'!$E147,'00 Aggregatore'!F:F)","v":24517314.75}]
[null,"BA0440","B.2.A.1.1.B) Costi per assistenza PLS",null,"BA0440",{"$f":"SUMIF('00 Aggregatore'!$B:$B,'00 CE'!$E148,'00 Aggregatore'!E:E)","v":6208374.4000000004},{"$f":"SUMIF('00 Aggregatore'!$B:$B,'00 CE'!$E148,'00 Aggregatore'!F:F)","v":6415070.5300000003}]
[null,"BA0450","B.2.A.1.1.C) Costi per assistenza Continuità assistenziale",null,"BA0450",{"$f":"SUMIF('00 Aggregatore'!$B:$B,'00 CE'!$E149,'00 Aggregatore'!E:E)","v":4008916.53},{"$f":"SUMIF('00 Aggregatore'!$B:$B,'00 CE'!$E149,'00 Aggregatore'!F:F)","v":3931463.93}]
[null,"BA0460","B.2.A.1.1.D) Altro (medicina dei servizi, psicologi, medici 118, ecc)",null,"BA0460",{"$f":"SUMIF('00 Aggregatore'!$B:$B,'00 CE'!$E150,'00 Aggregatore'!E:E)","v":889849.09},{"$f":"SUMIF('00 Aggregatore'!$B:$B,'00 CE'!$E150,'00 Aggregatore'!F:F)","v":789656.11}]
[null,"BA0470","B.2.A.1.2) - da pubblico (Aziende sanitarie pubbliche della Regione) - Mobilità intraregionale",null,"BA0470",{"$f":"SUMIF('00 Aggregatore'!$B:$B,'00 CE'!$E151,'00 Aggregatore'!E:E)","v":35057.19},{"$f":"SUMIF('00 Aggregatore'!$B:$B,'00 CE'!$E151,'00 Aggregatore'!F:F)","v":38671}]
[null,"BA0480","B.2.A.1.3) - da pubblico (Aziende sanitarie pubbliche Extraregione) - Mobilità extraregionale",null,"BA0480",{"$f":"SUMIF('00 Aggregatore'!$B:$B,'00 CE'!$E152,'00 Aggregatore'!E:E)","v":184748.58},{"$f":"SUMIF('00 Aggregatore'!$B:$B,'00 CE'!$E152,'00 Aggregatore'!F:F)","v":217107.5}]
[null,"BA0490","B.2.A.2)   Acquisti servizi sanitari per farmaceutica","S","BA0490",{"$f":"SUM(F154:F156)","v":54563948.050000004},{"$f":"SUM(G154:G156)","v":51864361.029999994}]
[null,"BA0500","B.2.A.2.1) - da convenzione",null,"BA0500",{"$f":"SUMIF('00 Aggregatore'!$B:$B,'00 CE'!$E154,'00 Aggregatore'!E:E)","v":52924145.520000003},{"$f":"SUMIF('00 Aggregatore'!$B:$B,'00 CE'!$E154,'00 Aggregatore'!F:F)","v":50129678.229999997}]
[null,"BA0510","B.2.A.2.2) - da pubblico (Aziende sanitarie pubbliche della Regione)- Mobilità intraregionale",null,"BA0510",{"$f":"SUMIF('00 Aggregatore'!$B:$B,'00 CE'!$E155,'00 Aggregatore'!E:E)","v":1251970.51},{"$f":"SUMIF('00 Aggregatore'!$B:$B,'00 CE'!$E155,'00 Aggregatore'!F:F)","v":1277628.07}]
[null,"BA0520","B.2.A.2.3) - da pubblico (Extraregione)",null,"BA0520",{"$f":"SUMIF('00 Aggregatore'!$B:$B,'00 CE'!$E156,'00 Aggregatore'!E:E)","v":387832.02},{"$f":"SUMIF('00 Aggregatore'!$B:$B,'00 CE'!$E156,'00 Aggregatore'!F:F)","v":457054.73}]
[null,"BA0530","B.2.A.3)   Acquisti servizi sanitari per assistenza specialistica ambulatoriale","S","BA0530",{"$f":"SUM(F158:F162)+F167","v":27519184.069999997},{"$f":"SUM(G158:G162)+G167","v":26809571.489999998}]
[null,"BA0540","B.2.A.3.1) - da pubblico (Aziende sanitarie pubbliche della Regione)",null,"BA0540",{"$f":"SUMIF('00 Aggregatore'!$B:$B,'00 CE'!$E158,'00 Aggregatore'!E:E)","v":8998122.1099999994},{"$f":"SUMIF('00 Aggregatore'!$B:$B,'00 CE'!$E158,'00 Aggregatore'!F:F)","v":8879359.5700000003}]
[null,"BA0550","B.2.A.3.2) - da pubblico (altri soggetti pubbl. della Regione)",null,"BA0550",{"$f":"SUMIF('00 Aggregatore'!$B:$B,'00 CE'!$E159,'00 Aggregatore'!E:E)","v":189344.67},{"$f":"SUMIF('00 Aggregatore'!$B:$B,'00 CE'!$E159,'00 Aggregatore'!F:F)","v":360209.89}]
[null,"BA0560","B.2.A.3.3) - da pubblico (Extraregione)",null,"BA0560",{"$f":"SUMIF('00 Aggregatore'!$B:$B,'00 CE'!$E160,'00 Aggregatore'!E:E)","v":4460024.9400000004},{"$f":"SUMIF('00 Aggregatore'!$B:$B,'00 CE'!$E160,'00 Aggregatore'!F:F)","v":4000753.58}]
[null,"BA0570","B.2.A.3.4) - da privato - Medici SUMAI",null,"BA0570",{"$f":"SUMIF('00 Aggregatore'!$B:$B,'00 CE'!$E161,'00 Aggregatore'!E:E)","v":4899151.05},{"$f":"SUMIF('00 Aggregatore'!$B:$B,'00 CE'!$E161,'00 Aggregatore'!F:F)","v":4486744.21}]
[null,"BA0580","B.2.A.3.5) - da privato","S","BA0580",{"$f":"SUM(F163:F166)","v":8757843.0999999996},{"$f":"SUM(G163:G166)","v":8885806.0099999998}]
[null,"BA0590","B.2.A.3.5.A) Servizi sanitari per assistenza specialistica da IRCCS privati e Policlinici privati",null,"BA0590",{"$f":"SUMIF('00 Aggregatore'!$B:$B,'00 CE'!$E163,'00 Aggregatore'!E:E)","v":60978.73},{"$f":"SUMIF('00 Aggregatore'!$B:$B,'00 CE'!$E163,'00 Aggregatore'!F:F)","v":83336.34}]
[null,"BA0600","B.2.A.3.5.B) Servizi sanitari per assistenza specialistica da Ospedali Classificati privati",null,"BA0600",{"$f":"SUMIF('00 Aggregatore'!$B:$B,'00 CE'!$E164,'00 Aggregatore'!E:E)","v":0},{"$f":"SUMIF('00 Aggregatore'!$B:$B,'00 CE'!$E164,'00 Aggregatore'!F:F)","v":0}]
[null,"BA0610","B.2.A.3.5.C) Servizi sanitari per assistenza specialistica da Case di Cura private",null,"BA0610",{"$f":"SUMIF('00 Aggregatore'!$B:$B,'00 CE'!$E165,'00 Aggregatore'!E:E)","v":5412858.8699999992},{"$f":"SUMIF('00 Aggregatore'!$B:$B,'00 CE'!$E165,'00 Aggregatore'!F:F)","v":5463686.8200000003}]
[null,"BA0620","B.2.A.3.5.D) Servizi sanitari per assistenza specialistica da altri privati",null,"BA0620",{"$f":"SUMIF('00 Aggregatore'!$B:$B,'00 CE'!$E166,'00 Aggregatore'!E:E)","v":3284005.5},{"$f":"SUMIF('00 Aggregatore'!$B:$B,'00 CE'!$E166,'00 Aggregatore'!F:F)","v":3338782.85}]
[null,"BA0630","B.2.A.3.6) - da privato per cittadini non residenti - Extraregione (mobilità attiva in compensazione)",null,"BA0630",{"$f":"SUMIF('00 Aggregatore'!$B:$B,'00 CE'!$E167,'00 Aggregatore'!E:E)","v":214698.2},{"$f":"SUMIF('00 Aggregatore'!$B:$B,'00 CE'!$E167,'00 Aggregatore'!F:F)","v":196698.22999999998}]
[null,"BA0640","B.2.A.4)   Acquisti servizi sanitari per assistenza riabilitativa","S","BA0640",{"$f":"SUM(F169:F173)","v":19907207.98},{"$f":"SUM(G169:G173)","v":19990902.559999999}]
[null,"BA0650","B.2.A.4.1) - da pubblico (Aziende sanitarie pubbliche della Regione)",null,"BA0650",{"$f":"SUMIF('00 Aggregatore'!$B:$B,'00 CE'!$E169,'00 Aggregatore'!E:E)","v":4855060.17},{"$f":"SUMIF('00 Aggregatore'!$B:$B,'00 CE'!$E169,'00 Aggregatore'!F:F)","v":4832965.95}]
[null,"BA0660","B.2.A.4.2) - da pubblico (altri soggetti pubbl. della Regione)",null,"BA0660",{"$f":"SUMIF('00 Aggregatore'!$B:$B,'00 CE'!$E170,'00 Aggregatore'!E:E)","v":0},{"$f":"SUMIF('00 Aggregatore'!$B:$B,'00 CE'!$E170,'00 Aggregatore'!F:F)","v":0}]
[null,"BA0670","B.2.A.4.3) - da pubblico (Extraregione) non soggetti a compensazione",null,"BA0670",{"$f":"SUMIF('00 Aggregatore'!$B:$B,'00 CE'!$E171,'00 Aggregatore'!E:E)","v":0},{"$f":"SUMIF('00 Aggregatore'!$B:$B,'00 CE'!$E171,'00 Aggregatore'!F:F)","v":0}]
[null,"BA0680","B.2.A.4.4) - da privato (intraregionale)",null,"BA0680",{"$f":"SUMIF('00 Aggregatore'!$B:$B,'00 CE'!$E172,'00 Aggregatore'!E:E)","v":14460769.459999999},{"$f":"SUMIF('00 Aggregatore'!$B:$B,'00 CE'!$E172,'00 Aggregatore'!F:F)","v":14612451.73}]
[null,"BA0690","B.2.A.4.5) - da privato (extraregionale)",null,"BA0690",{"$f":"SUMIF('00 Aggregatore'!$B:$B,'00 CE'!$E173,'00 Aggregatore'!E:E)","v":591378.35},{"$f":"SUMIF('00 Aggregatore'!$B:$B,'00 CE'!$E173,'00 Aggregatore'!F:F)","v":545484.88}]
[null,"BA0700","B.2.A.5)   Acquisti servizi sanitari per assistenza integrativa","S","BA0700",{"$f":"SUM(F175:F178)","v":1813040.82},{"$f":"SUM(G175:G178)","v":1802068.84}]
[null,"BA0710","B.2.A.5.1) - da pubblico (Aziende sanitarie pubbliche della Regione)",null,"BA0710",{"$f":"SUMIF('00 Aggregatore'!$B:$B,'00 CE'!$E175,'00 Aggregatore'!E:E)","v":0},{"$f":"SUMIF('00 Aggregatore'!$B:$B,'00 CE'!$E175,'00 Aggregatore'!F:F)","v":0}]
[null,"BA0720","B.2.A.5.2) - da pubblico (altri soggetti pubbl. della Regione)",null,"BA0720",{"$f":"SUMIF('00 Aggregatore'!$B:$B,'00 CE'!$E176,'00 Aggregatore'!E:E)","v":0},{"$f":"SUMIF('00 Aggregatore'!$B:$B,'00 CE'!$E176,'00 Aggregatore'!F:F)","v":0}]
[null,"BA0730","B.2.A.5.3) - da pubblico (Extraregione)",null,"BA0730",{"$f":"SUMIF('00 Aggregatore'!$B:$B,'00 CE'!$E177,'00 Aggregatore'!E:E)","v":0},{"$f":"SUMIF('00 Aggregatore'!$B:$B,'00 CE'!$E177,'00 Aggregatore'!F:F)","v":0}]
[null,"BA0740","B.2.A.5.4) - da privato",null,"BA0740",{"$f":"SUMIF('00 Aggregatore'!$B:$B,'00 CE'!$E178,'00 Aggregatore'!E:E)","v":1813040.82},{"$f":"SUMIF('00 Aggregatore'!$B:$B,'00 CE'!$E178,'00 Aggregatore'!F:F)","v":1802068.84}]
[null,"BA0750","B.2.A.6)   Acquisti servizi sanitari per assistenza protesica","S","BA0750",{"$f":"SUM(F180:F183)","v":6384295.54},{"$f":"SUM(G180:G183)","v":6303229.0099999998}]
[null,"BA0760","B.2.A.6.1) - da pubblico (Aziende sanitarie pubbliche della Regione)",null,"BA0760",{"$f":"SUMIF('00 Aggregatore'!$B:$B,'00 CE'!$E180,'00 Aggregatore'!E:E)","v":0},{"$f":"SUMIF('00 Aggregatore'!$B:$B,'00 CE'!$E180,'00 Aggregatore'!F:F)","v":0}]
[null,"BA0770","B.2.A.6.2) - da pubblico (altri soggetti pubbl. della Regione)",null,"BA0770",{"$f":"SUMIF('00 Aggregatore'!$B:$B,'00 CE'!$E181,'00 Aggregatore'!E:E)","v":0},{"$f":"SUMIF('00 Aggregatore'!$B:$B,'00 CE'!$E181,'00 Aggregatore'!F:F)","v":0}]
[null,"BA0780","B.2.A.6.3) - da pubblico (Extraregione)",null,"BA0780",{"$f":"SUMIF('00 Aggregatore'!$B:$B,'00 CE'!$E182,'00 Aggregatore'!E:E)","v":0},{"$f":"SUMIF('00 Aggregatore'!$B:$B,'00 CE'!$E182,'00 Aggregatore'!F:F)","v":0}]
[null,"BA0790","B.2.A.6.4) - da privato",null,"BA0790",{"$f":"SUMIF('00 Aggregatore'!$B:$B,'00 CE'!$E183,'00 Aggregatore'!E:E)","v":6384295.54},{"$f":"SUMIF('00 Aggregatore'!$B:$B,'00 CE'!$E183,'00 Aggregatore'!F:F)","v":6303229.0099999998}]
[null,"BA0800","B.2.A.7)   Acquisti servizi sanitari per assistenza ospedaliera","S","BA0800",{"$f":"SUM(F185:F188)+F193","v":125006439.52000001},{"$f":"SUM(G185:G188)+G193","v":123489437.36999999}]
[null,"BA0810","B.2.A.7.1) - da pubblico (Aziende sanitarie pubbliche della Regione)",null,"BA0810",{"$f":"SUMIF('00 Aggregatore'!$B:$B,'00 CE'!$E185,'00 Aggregatore'!E:E)","v":28230091.68},{"$f":"SUMIF('00 Aggregatore'!$B:$B,'00 CE'!$E185,'00 Aggregatore'!F:F)","v":26481532.390000001}]
[null,"BA0820","B.2.A.7.2) - da pubblico (altri soggetti pubbl. della Regione)",null,"BA0820",{"$f":"SUMIF('00 Aggregatore'!$B:$B,'00 CE'!$E186,'00 Aggregatore'!E:E)","v":0},{"$f":"SUMIF('00 Aggregatore'!$B:$B,'00 CE'!$E186,'00 Aggregatore'!F:F)","v":0}]
[null,"BA0830","B.2.A.7.3) - da pubblico (Extraregione)",null,"BA0830",{"$f":"SUMIF('00 Aggregatore'!$B:$B,'00 CE'!$E187,'00 Aggregatore'!E:E)","v":23048879.050000001},{"$f":"SUMIF('00 Aggregatore'!$B:$B,'00 CE'!$E187,'00 Aggregatore'!F:F)","v":24057993.460000001}]
[null,"BA0840","B.2.A.7.4) - da privato","S","BA0840",{"$f":"SUM(F189:F192)","v":61809764.719999999},{"$f":"SUM(G189:G192)","v":62664028.379999995}]
[null,"BA0850","B.2.A.7.4.A) Servizi sanitari per assistenza ospedaliera da IRCCS privati e Policlinici privati",null,"BA0850",{"$f":"SUMIF('00 Aggregatore'!$B:$B,'00 CE'!$E189,'00 Aggregatore'!E:E)","v":0},{"$f":"SUMIF('00 Aggregatore'!$B:$B,'00 CE'!$E189,'00 Aggregatore'!F:F)","v":0}]
[null,"BA0860","B.2.A.7.4.B) Servizi sanitari per assistenza ospedaliera da Ospedali Classificati privati",null,"BA0860",{"$f":"SUMIF('00 Aggregatore'!$B:$B,'00 CE'!$E190,'00 Aggregatore'!E:E)","v":0},{"$f":"SUMIF('00 Aggregatore'!$B:$B,'00 CE'!$E190,'00 Aggregatore'!F:F)","v":0}]
[null,"BA0870","B.2.A.7.4.C) Servizi sanitari per assistenza ospedaliera da Case di Cura private",null,"BA0870",{"$f":"SUMIF('00 Aggregatore'!$B:$B,'00 CE'!$E191,'00 Aggregatore'!E:E)","v":61809764.719999999},{"$f":"SUMIF('00 Aggregatore'!$B:$B,'00 CE'!$E191,'00 Aggregatore'!F:F)","v":62664028.379999995}]
[null,"BA0880","B.2.A.7.4.D) Servizi sanitari per assistenza ospedaliera da altri privati",null,"BA0880",{"$f":"SUMIF('00 Aggregatore'!$B:$B,'00 CE'!$E192,'00 Aggregatore'!E:E)","v":0},{"$f":"SUMIF('00 Aggregatore'!$B:$B,'00 CE'!$E192,'00 Aggregatore'!F:F)","v":0}]
[null,"BA0890","B.2.A.7.5) - da privato per cittadini non residenti - Extraregione (mobilità attiva in compensazione)",null,"BA0890",{"$f":"SUMIF('00 Aggregatore'!$B:$B,'00 CE'!$E193,'00 Aggregatore'!E:E)","v":11917704.07},{"$f":"SUMIF('00 Aggregatore'!$B:$B,'00 CE'!$E193,'00 Aggregatore'!F:F)","v":10285883.140000001}]
[null,"BA0900","B.2.A.8)   Acquisto prestazioni di psichiatria residenziale e semiresidenziale","S","BA0900",{"$f":"SUM(F195:F199)","v":13199111.060000001},{"$f":"SUM(G195:G199)","v":13021762.400000002}]
[null,"BA0910","B.2.A.8.1) - da pubblico (Aziende sanitarie pubbliche della Regione)",null,"BA0910",{"$f":"SUMIF('00 Aggregatore'!$B:$B,'00 CE'!$E195,'00 Aggregatore'!E:E)","v":1648164.66},{"$f":"SUMIF('00 Aggregatore'!$B:$B,'00 CE'!$E195,'00 Aggregatore'!F:F)","v":1551575.5}]
[null,"BA0920","B.2.A.8.2) - da pubblico (altri soggetti pubbl. della Regione)",null,"BA0920",{"$f":"SUMIF('00 Aggregatore'!$B:$B,'00 CE'!$E196,'00 Aggregatore'!E:E)","v":0},{"$f":"SUMIF('00 Aggregatore'!$B:$B,'00 CE'!$E196,'00 Aggregatore'!F:F)","v":0}]
[null,"BA0930","B.2.A.8.3) - da pubblico (Extraregione) - non soggette a compensazione",null,"BA0930",{"$f":"SUMIF('00 Aggregatore'!$B:$B,'00 CE'!$E197,'00 Aggregatore'!E:E)","v":6667},{"$f":"SUMIF('00 Aggregatore'!$B:$B,'00 CE'!$E197,'00 Aggregatore'!F:F)","v":81781.600000000006}]
[null,"BA0940","B.2.A.8.4) - da privato (intraregionale)",null,"BA0940",{"$f":"SUMIF('00 Aggregatore'!$B:$B,'00 CE'!$E198,'00 Aggregatore'!E:E)","v":9671880.5899999999},{"$f":"SUMIF('00 Aggregatore'!$B:$B,'00 CE'!$E198,'00 Aggregatore'!F:F)","v":9798519.8400000017}]
[null,"BA0950","B.2.A.8.5) - da privato (extraregionale)",null,"BA0950",{"$f":"SUMIF('00 Aggregatore'!$B:$B,'00 CE'!$E199,'00 Aggregatore'!E:E)","v":1872398.81},{"$f":"SUMIF('00 Aggregatore'!$B:$B,'00 CE'!$E199,'00 Aggregatore'!F:F)","v":1589885.46}]
[null,"BA0960","B.2.A.9)   Acquisto prestazioni di distribuzione farmaci File F","S","BA0960",{"$f":"SUM(F201:F206)","v":5976832.0300000003},{"$f":"SUM(G201:G206)","v":7092976.6900000004}]
[null,"BA0970","B.2.A.9.1) - da pubblico (Aziende sanitarie pubbliche della Regione) - Mobilità intraregionale",null,"BA0970",{"$f":"SUMIF('00 Aggregatore'!$B:$B,'00 CE'!$E201,'00 Aggregatore'!E:E)","v":4391409.7},{"$f":"SUMIF('00 Aggregatore'!$B:$B,'00 CE'!$E201,'00 Aggregatore'!F:F)","v":4464112.37}]
[null,"BA0980","B.2.A.9.2) - da pubblico (altri soggetti pubbl. della Regione)",null,"BA0980",{"$f":"SUMIF('00 Aggregatore'!$B:$B,'00 CE'!$E202,'00 Aggregatore'!E:E)","v":0},{"$f":"SUMIF('00 Aggregatore'!$B:$B,'00 CE'!$E202,'00 Aggregatore'!F:F)","v":0}]
[null,"BA0990","B.2.A.9.3) - da pubblico (Extraregione)",null,"BA0990",{"$f":"SUMIF('00 Aggregatore'!$B:$B,'00 CE'!$E203,'00 Aggregatore'!E:E)","v":1585422.33},{"$f":"SUMIF('00 Aggregatore'!$B:$B,'00 CE'!$E203,'00 Aggregatore'!F:F)","v":2195879.04}]
[null,"BA1000","B.2.A.9.4) - da privato (intraregionale)",null,"BA1000",{"$f":"SUMIF('00 Aggregatore'!$B:$B,'00 CE'!$E204,'00 Aggregatore'!E:E)","v":0},{"$f":"SUMIF('00 Aggregatore'!$B:$B,'00 CE'!$E204,'00 Aggregatore'!F:F)","v":432985.28}]
[null,"BA1010","B.2.A.9.5) - da privato (extraregionale)",null,"BA1010",{"$f":"SUMIF('00 Aggregatore'!$B:$B,'00 CE'!$E205,'00 Aggregatore'!E:E)","v":0},{"$f":"SUMIF('00 Aggregatore'!$B:$B,'00 CE'!$E205,'00 Aggregatore'!F:F)","v":0}]
[null,"BA1020","B.2.A.9.6) - da privato per cittadini non residenti - Extraregione (mobilità attiva in compensazione)",null,"BA1020",{"$f":"SUMIF('00 Aggregatore'!$B:$B,'00 CE'!$E206,'00 Aggregatore'!E:E)","v":0},{"$f":"SUMIF('00 Aggregatore'!$B:$B,'00 CE'!$E206,'00 Aggregatore'!F:F)","v":0}]
[null,"BA1030","B.2.A.10)   Acquisto prestazioni termali in convenzione","S","BA1030",{"$f":"SUM(F208:F212)","v":2288663.8299999996},{"$f":"SUM(G208:G212)","v":2149505.71}]
[null,"BA1040","B.2.A.10.1) - da pubblico (Aziende sanitarie pubbliche della Regione) - Mobilità intraregionale",null,"BA1040",{"$f":"SUMIF('00 Aggregatore'!$B:$B,'00 CE'!$E208,'00 Aggregatore'!E:E)","v":0},{"$f":"SUMIF('00 Aggregatore'!$B:$B,'00 CE'!$E208,'00 Aggregatore'!F:F)","v":0}]
[null,"BA1050","B.2.A.10.2) - da pubblico (altri soggetti pubbl. della Regione)",null,"BA1050",{"$f":"SUMIF('00 Aggregatore'!$B:$B,'00 CE'!$E209,'00 Aggregatore'!E:E)","v":0},{"$f":"SUMIF('00 Aggregatore'!$B:$B,'00 CE'!$E209,'00 Aggregatore'!F:F)","v":0}]
[null,"BA1060","B.2.A.10.3) - da pubblico (Extraregione)",null,"BA1060",{"$f":"SUMIF('00 Aggregatore'!$B:$B,'00 CE'!$E210,'00 Aggregatore'!E:E)","v":159884.29},{"$f":"SUMIF('00 Aggregatore'!$B:$B,'00 CE'!$E210,'00 Aggregatore'!F:F)","v":95302.31}]
[null,"BA1070","B.2.A.10.4) - da privato",null,"BA1070",{"$f":"SUMIF('00 Aggregatore'!$B:$B,'00 CE'!$E211,'00 Aggregatore'!E:E)","v":1888589.9699999997},{"$f":"SUMIF('00 Aggregatore'!$B:$B,'00 CE'!$E211,'00 Aggregatore'!F:F)","v":1821580.51}]
[null,"BA1080","B.2.A.10.5) - da privato per cittadini non residenti - Extraregione (mobilità attiva in compensazione)",null,"BA1080",{"$f":"SUMIF('00 Aggregatore'!$B:$B,'00 CE'!$E212,'00 Aggregatore'!E:E)","v":240189.57},{"$f":"SUMIF('00 Aggregatore'!$B:$B,'00 CE'!$E212,'00 Aggregatore'!F:F)","v":232622.88999999998}]
[null,"BA1090","B.2.A.11)   Acquisto prestazioni di trasporto sanitario","S","BA1090",{"$f":"SUM(F214:F217)","v":8512737.8499999996},{"$f":"SUM(G214:G217)","v":8783342.459999999}]
[null,"BA1100","B.2.A.11.1) - da pubblico (Aziende sanitarie pubbliche della Regione) - Mobilità intraregionale",null,"BA1100",{"$f":"SUMIF('00 Aggregatore'!$B:$B,'00 CE'!$E214,'00 Aggregatore'!E:E)","v":124342.79},{"$f":"SUMIF('00 Aggregatore'!$B:$B,'00 CE'!$E214,'00 Aggregatore'!F:F)","v":103216}]
[null,"BA1110","B.2.A.11.2) - da pubblico (altri soggetti pubbl. della Regione)",null,"BA1110",{"$f":"SUMIF('00 Aggregatore'!$B:$B,'00 CE'!$E215,'00 Aggregatore'!E:E)","v":0},{"$f":"SUMIF('00 Aggregatore'!$B:$B,'00 CE'!$E215,'00 Aggregatore'!F:F)","v":0}]
[null,"BA1120","B.2.A.11.3) - da pubblico (Extraregione)",null,"BA1120",{"$f":"SUMIF('00 Aggregatore'!$B:$B,'00 CE'!$E216,'00 Aggregatore'!E:E)","v":228483.68},{"$f":"SUMIF('00 Aggregatore'!$B:$B,'00 CE'!$E216,'00 Aggregatore'!F:F)","v":344124.9}]
[null,"BA1130","B.2.A.11.4) - da privato",null,"BA1130",{"$f":"SUMIF('00 Aggregatore'!$B:$B,'00 CE'!$E217,'00 Aggregatore'!E:E)","v":8159911.3799999999},{"$f":"SUMIF('00 Aggregatore'!$B:$B,'00 CE'!$E217,'00 Aggregatore'!F:F)","v":8336001.5599999996}]
[null,"BA1140","B.2.A.12)   Acquisto prestazioni Socio-Sanitarie a rilevanza sanitaria","S","BA1140",{"$f":"SUM(F219:F223)","v":16209312.369999997},{"$f":"SUM(G219:G223)","v":16307538.569999998}]
[null,"BA1150","B.2.A.12.1) - da pubblico (Aziende sanitarie pubbliche della Regione) - Mobilità intraregionale",null,"BA1150",{"$f":"SUMIF('00 Aggregatore'!$B:$B,'00 CE'!$E219,'00 Aggregatore'!E:E)","v":1737461.12},{"$f":"SUMIF('00 Aggregatore'!$B:$B,'00 CE'!$E219,'00 Aggregatore'!F:F)","v":1758520.3800000001}]
[null,"BA1160","B.2.A.12.2) - da pubblico (altri soggetti pubblici della Regione)",null,"BA1160",{"$f":"SUMIF('00 Aggregatore'!$B:$B,'00 CE'!$E220,'00 Aggregatore'!E:E)","v":0},{"$f":"SUMIF('00 Aggregatore'!$B:$B,'00 CE'!$E220,'00 Aggregatore'!F:F)","v":0}]
[null,"BA1170","B.2.A.12.3) - da pubblico (Extraregione) non soggette a compensazione",null,"BA1170",{"$f":"SUMIF('00 Aggregatore'!$B:$B,'00 CE'!$E221,'00 Aggregatore'!E:E)","v":168459.48},{"$f":"SUMIF('00 Aggregatore'!$B:$B,'00 CE'!$E221,'00 Aggregatore'!F:F)","v":160969.38}]
[null,"BA1180","B.2.A.12.4) - da privato (intraregionale)",null,"BA1180",{"$f":"SUMIF('00 Aggregatore'!$B:$B,'00 CE'!$E222,'00 Aggregatore'!E:E)","v":12551624.019999998},{"$f":"SUMIF('00 Aggregatore'!$B:$B,'00 CE'!$E222,'00 Aggregatore'!F:F)","v":12500635.899999999}]
[null,"BA1190","B.2.A.12.5) - da privato (extraregionale)",null,"BA1190",{"$f":"SUMIF('00 Aggregatore'!$B:$B,'00 CE'!$E223,'00 Aggregatore'!E:E)","v":1751767.75},{"$f":"SUMIF('00 Aggregatore'!$B:$B,'00 CE'!$E223,'00 Aggregatore'!F:F)","v":1887412.9100000001}]
[null,"BA1200","B.2.A.13)  Compartecipazione al personale per att. libero-prof. (intramoenia)","S","BA1200",{"$f":"SUM(F225:F231)","v":3293488.61},{"$f":"SUM(G225:G231)","v":3321031.3200000003}]
[null,"BA1210","B.2.A.13.1)  Compartecipazione al personale per att. libero professionale intramoenia - Area ospedaliera",null,"BA1210",{"$f":"SUMIF('00 Aggregatore'!$B:$B,'00 CE'!$E225,'00 Aggregatore'!E:E)","v":36801.340000000004},{"$f":"SUMIF('00 Aggregatore'!$B:$B,'00 CE'!$E225,'00 Aggregatore'!F:F)","v":54218.100000000006}]
[null,"BA1220","B.2.A.13.2)  Compartecipazione al personale per att. libero professionale intramoenia- Area specialistica",null,"BA1220",{"$f":"SUMIF('00 Aggregatore'!$B:$B,'00 CE'!$E226,'00 Aggregatore'!E:E)","v":2790651.77},{"$f":"SUMIF('00 Aggregatore'!$B:$B,'00 CE'!$E226,'00 Aggregatore'!F:F)","v":2563747.4700000002}]
[null,"BA1230","B.2.A.13.3)  Compartecipazione al personale per att. libero professionale intramoenia - Area sanità pubblica",null,"BA1230",{"$f":"SUMIF('00 Aggregatore'!$B:$B,'00 CE'!$E227,'00 Aggregatore'!E:E)","v":19073.689999999999},{"$f":"SUMIF('00 Aggregatore'!$B:$B,'00 CE'!$E227,'00 Aggregatore'!F:F)","v":15233.61}]
[null,"BA1240","B.2.A.13.4)  Compartecipazione al personale per att. libero professionale intramoenia - Consulenze (ex art. 55 c.1 lett. c), d) ed ex Art. 57-58)",null,"BA1240",{"$f":"SUMIF('00 Aggregatore'!$B:$B,'00 CE'!$E228,'00 Aggregatore'!E:E)","v":371493.34},{"$f":"SUMIF('00 Aggregatore'!$B:$B,'00 CE'!$E228,'00 Aggregatore'!F:F)","v":579327.30000000005}]
[null,"BA1250","B.2.A.13.5)  Compartecipazione al personale per att. libero professionale intramoenia - Consulenze (ex art. 55 c.1 lett. c), d) ed ex Art. 57-58) (Aziende sanitarie pubbliche della Regione)",null,"BA1250",{"$f":"SUMIF('00 Aggregatore'!$B:$B,'00 CE'!$E229,'00 Aggregatore'!E:E)","v":0},{"$f":"SUMIF('00 Aggregatore'!$B:$B,'00 CE'!$E229,'00 Aggregatore'!F:F)","v":0}]
[null,"BA1260","B.2.A.13.6)  Compartecipazione al personale per att. libero professionale intramoenia - Altro",null,"BA1260",{"$f":"SUMIF('00 Aggregatore'!$B:$B,'00 CE'!$E230,'00 Aggregatore'!E:E)","v":75468.47},{"$f":"SUMIF('00 Aggregatore'!$B:$B,'00 CE'!$E230,'00 Aggregatore'!F:F)","v":108504.84}]
[null,"BA1270","B.2.A.13.7)  Compartecipazione al personale per att. libero  professionale intramoenia - Altro (Aziende sanitarie pubbliche della Regione)",null,"BA1270",{"$f":"SUMIF('00 Aggregatore'!$B:$B,'00 CE'!$E231,'00 Aggregatore'!E:E)","v":0},{"$f":"SUMIF('00 Aggregatore'!$B:$B,'00 CE'!$E231,'00 Aggregatore'!F:F)","v":0}]
[null,"BA1280","B.2.A.14)  Rimborsi, assegni e contributi sanitari","S","BA1280",{"$f":"SUM(F233:F238)","v":1751188.4500000002},{"$f":"SUM(G233:G238)","v":2143960.7800000003}]
[null,"BA1290","B.2.A.14.1)  Contributi ad associazioni di volontariato",null,"BA1290",{"$f":"SUMIF('00 Aggregatore'!$B:$B,'00 CE'!$E233,'00 Aggregatore'!E:E)","v":326600},{"$f":"SUMIF('00 Aggregatore'!$B:$B,'00 CE'!$E233,'00 Aggregatore'!F:F)","v":349365.76000000001}]
[null,"BA1300","B.2.A.14.2)  Rimborsi per cure all'estero",null,"BA1300",{"$f":"SUMIF('00 Aggregatore'!$B:$B,'00 CE'!$E234,'00 Aggregatore'!E:E)","v":0},{"$f":"SUMIF('00 Aggregatore'!$B:$B,'00 CE'!$E234,'00 Aggregatore'!F:F)","v":2069.39}]
[null,"BA1310","B.2.A.14.3)  Contributi a società partecipate e/o enti dipendenti della Regione",null,"BA1310",{"$f":"SUMIF('00 Aggregatore'!$B:$B,'00 CE'!$E235,'00 Aggregatore'!E:E)","v":0},{"$f":"SUMIF('00 Aggregatore'!$B:$B,'00 CE'!$E235,'00 Aggregatore'!F:F)","v":0}]
[null,"BA1320","B.2.A.14.4)  Contributo Legge 210/92",null,"BA1320",{"$f":"SUMIF('00 Aggregatore'!$B:$B,'00 CE'!$E236,'00 Aggregatore'!E:E)","v":0},{"$f":"SUMIF('00 Aggregatore'!$B:$B,'00 CE'!$E236,'00 Aggregatore'!F:F)","v":0}]
[null,"BA1330","B.2.A.14.5)  Altri rimborsi, assegni e contributi",null,"BA1330",{"$f":"SUMIF('00 Aggregatore'!$B:$B,'00 CE'!$E237,'00 Aggregatore'!E:E)","v":1424508.4500000002},{"$f":"SUMIF('00 Aggregatore'!$B:$B,'00 CE'!$E237,'00 Aggregatore'!F:F)","v":1792525.6300000001}]
[null,"BA1340","B.2.A.14.6)  Rimborsi, assegni e contributi v/Aziende sanitarie pubbliche della Regione",null,"BA1340",{"$f":"SUMIF('00 Aggregatore'!$B:$B,'00 CE'!$E238,'00 Aggregatore'!E:E)","v":80},{"$f":"SUMIF('00 Aggregatore'!$B:$B,'00 CE'!$E238,'00 Aggregatore'!F:F)","v":0}]
[null,"BA1350","B.2.A.15)  Consulenze, Collaborazioni,  Interinale e altre prestazioni di lavoro sanitarie e sociosanitarie","S","BA1350",{"$f":"SUM(F240:F242)+F249","v":6723251.46},{"$f":"SUM(G240:G242)+G249","v":6574839.0399999991}]
[null,"BA1360","B.2.A.15.1) Consulenze sanitarie e sociosan. da Aziende sanitarie pubbliche della Regione",null,"BA1360",{"$f":"SUMIF('00 Aggregatore'!$B:$B,'00 CE'!$E240,'00 Aggregatore'!E:E)","v":298526.69},{"$f":"SUMIF('00 Aggregatore'!$B:$B,'00 CE'!$E240,'00 Aggregatore'!F:F)","v":416373.3}]
[null,"BA1370","B.2.A.15.2) Consulenze sanitarie e sociosanit. da terzi - Altri soggetti pubblici",null,"BA1370",{"$f":"SUMIF('00 Aggregatore'!$B:$B,'00 CE'!$E241,'00 Aggregatore'!E:E)","v":24433.75},{"$f":"SUMIF('00 Aggregatore'!$B:$B,'00 CE'!$E241,'00 Aggregatore'!F:F)","v":0}]
[null,"BA1380","B.2.A.15.3) Consulenze, Collaborazioni,  Interinale e altre prestazioni di lavoro sanitarie e socios. da privato","S","BA1380",{"$f":"SUM(F243:F248)","v":6390500.9299999997},{"$f":"SUM(G243:G248)","v":6104477.8199999994}]
[null,"BA1390","B.2.A.15.3.A) Consulenze sanitarie da privato - articolo 55, comma 2, CCNL 8 giugno 2000",null,"BA1390",{"$f":"SUMIF('00 Aggregatore'!$B:$B,'00 CE'!$E243,'00 Aggregatore'!E:E)","v":2372315.1800000002},{"$f":"SUMIF('00 Aggregatore'!$B:$B,'00 CE'!$E243,'00 Aggregatore'!F:F)","v":2164804.17}]
[null,"BA1400","B.2.A.15.3.B) Altre consulenze sanitarie e sociosanitarie da privato",null,"BA1400",{"$f":"SUMIF('00 Aggregatore'!$B:$B,'00 CE'!$E244,'00 Aggregatore'!E:E)","v":8005.29},{"$f":"SUMIF('00 Aggregatore'!$B:$B,'00 CE'!$E244,'00 Aggregatore'!F:F)","v":4381.71}]
[null,"BA1410","B.2.A.15.3.C) Collaborazioni coordinate e continuative sanitarie e socios. da privato",null,"BA1410",{"$f":"SUMIF('00 Aggregatore'!$B:$B,'00 CE'!$E245,'00 Aggregatore'!E:E)","v":8413.1200000000008},{"$f":"SUMIF('00 Aggregatore'!$B:$B,'00 CE'!$E245,'00 Aggregatore'!F:F)","v":0}]
[null,"BA1420","B.2.A.15.3.D) Indennità a personale universitario - area sanitaria ",null,"BA1420",{"$f":"SUMIF('00 Aggregatore'!$B:$B,'00 CE'!$E246,'00 Aggregatore'!E:E)","v":242210.34},{"$f":"SUMIF('00 Aggregatore'!$B:$B,'00 CE'!$E246,'00 Aggregatore'!F:F)","v":256736.03}]
[null,"BA1430","B.2.A.15.3.E) Lavoro interinale - area sanitaria ",null,"BA1430",{"$f":"SUMIF('00 Aggregatore'!$B:$B,'00 CE'!$E247,'00 Aggregatore'!E:E)","v":2608784.9},{"$f":"SUMIF('00 Aggregatore'!$B:$B,'00 CE'!$E247,'00 Aggregatore'!F:F)","v":2862789.15}]
[null,"BA1440","B.2.A.15.3.F) Altre collaborazioni e prestazioni di lavoro - area sanitaria ",null,"BA1440",{"$f":"SUMIF('00 Aggregatore'!$B:$B,'00 CE'!$E248,'00 Aggregatore'!E:E)","v":1150772.0999999999},{"$f":"SUMIF('00 Aggregatore'!$B:$B,'00 CE'!$E248,'00 Aggregatore'!F:F)","v":815766.76}]
[null,"BA1450","B.2.A.15.4) Rimborso oneri stipendiali del personale sanitario in comando","S","BA1450",{"$f":"SUM(F250:F252)","v":9790.09},{"$f":"SUM(G250:G252)","v":53987.92}]
[null,"BA1460","B.2.A.15.4.A) Rimborso oneri stipendiali personale sanitario in comando da Aziende sanitarie pubbliche della Regione",null,"BA1460",{"$f":"SUMIF('00 Aggregatore'!$B:$B,'00 CE'!$E250,'00 Aggregatore'!E:E)","v":0},{"$f":"SUMIF('00 Aggregatore'!$B:$B,'00 CE'!$E250,'00 Aggregatore'!F:F)","v":0}]
[null,"BA1470","B.2.A.15.4.B) Rimborso oneri stipendiali personale sanitario in comando da Regioni, soggetti pubblici e da Università",null,"BA1470",{"$f":"SUMIF('00 Aggregatore'!$B:$B,'00 CE'!$E251,'00 Aggregatore'!E:E)","v":0},{"$f":"SUMIF('00 Aggregatore'!$B:$B,'00 CE'!$E251,'00 Aggregatore'!F:F)","v":0}]
[null,"BA1480","B.2.A.15.4.C) Rimborso oneri stipendiali personale sanitario in comando da aziende di altre Regioni (Extraregione)",null,"BA1480",{"$f":"SUMIF('00 Aggregatore'!$B:$B,'00 CE'!$E252,'00 Aggregatore'!E:E)","v":9790.09},{"$f":"SUMIF('00 Aggregatore'!$B:$B,'00 CE'!$E252,'00 Aggregatore'!F:F)","v":53987.92}]
[null,"BA1490","B.2.A.16) Altri servizi sanitari e sociosanitari a rilevanza sanitaria","S","BA1490",{"$f":"SUM(F254:F258)","v":2754715.62},{"$f":"SUM(G254:G258)","v":5607016.7799999993}]
[null,"BA1500","B.2.A.16.1)  Altri servizi sanitari e sociosanitari a rilevanza sanitaria da pubblico - Aziende sanitarie pubbliche della Regione",null,"BA1500",{"$f":"SUMIF('00 Aggregatore'!$B:$B,'00 CE'!$E254,'00 Aggregatore'!E:E)","v":13109.54},{"$f":"SUMIF('00 Aggregatore'!$B:$B,'00 CE'!$E254,'00 Aggregatore'!F:F)","v":0}]
[null,"BA1510","B.2.A.16.2)  Altri servizi sanitari e sociosanitari  a rilevanza sanitaria da pubblico - Altri soggetti pubblici della Regione",null,"BA1510",{"$f":"SUMIF('00 Aggregatore'!$B:$B,'00 CE'!$E255,'00 Aggregatore'!E:E)","v":0},{"$f":"SUMIF('00 Aggregatore'!$B:$B,'00 CE'!$E255,'00 Aggregatore'!F:F)","v":0}]
[null,"BA1520","B.2.A.16.3) Altri servizi sanitari e sociosanitari a rilevanza sanitaria da pubblico (Extraregione)",null,"BA1520",{"$f":"SUMIF('00 Aggregatore'!$B:$B,'00 CE'!$E256,'00 Aggregatore'!E:E)","v":0},{"$f":"SUMIF('00 Aggregatore'!$B:$B,'00 CE'!$E256,'00 Aggregatore'!F:F)","v":0}]
[null,"BA1530","B.2.A.16.4)  Altri servizi sanitari da privato",null,"BA1530",{"$f":"SUMIF('00 Aggregatore'!$B:$B,'00 CE'!$E257,'00 Aggregatore'!E:E)","v":2741606.08},{"$f":"SUMIF('00 Aggregatore'!$B:$B,'00 CE'!$E257,'00 Aggregatore'!F:F)","v":3534647.28}]
[null,"BA1540","B.2.A.16.5)  Costi per servizi sanitari - Mobilità internazionale passiva",null,"BA1540",{"$f":"SUMIF('00 Aggregatore'!$B:$B,'00 CE'!$E258,'00 Aggregatore'!E:E)","v":0},{"$f":"SUMIF('00 Aggregatore'!$B:$B,'00 CE'!$E258,'00 Aggregatore'!F:F)","v":2072369.5}]
[null,"BA1550","B.2.A.17) Costi per differenziale tariffe TUC",null,"BA1550",{"$f":"SUMIF('00 Aggregatore'!$B:$B,'00 CE'!$E259,'00 Aggregatore'!E:E)","v":0},{"$f":"SUMIF('00 Aggregatore'!$B:$B,'00 CE'!$E259,'00 Aggregatore'!F:F)","v":0}]
[null,"BA1560","B.2.B) Acquisti di servizi non sanitari","S","BA1560",{"$f":"F261+F279+F292","v":36785749.479999989},{"$f":"G261+G279+G292","v":36877695.939999998}]
[null,"BA1570","B.2.B.1) Servizi non sanitari ","S","BA1570",{"$f":"SUM(F262:F272)+F275","v":35538780.359999992},{"$f":"SUM(G262:G272)+G275","v":35624428.469999999}]
[null,"BA1580","B.2.B.1.1)   Lavanderia",null,"BA1580",{"$f":"SUMIF('00 Aggregatore'!$B:$B,'00 CE'!$E262,'00 Aggregatore'!E:E)","v":5274953.32},{"$f":"SUMIF('00 Aggregatore'!$B:$B,'00 CE'!$E262,'00 Aggregatore'!F:F)","v":4633285.6399999997}]
[null,"BA1590","B.2.B.1.2)   Pulizia",null,"BA1590",{"$f":"SUMIF('00 Aggregatore'!$B:$B,'00 CE'!$E263,'00 Aggregatore'!E:E)","v":6089443.3399999999},{"$f":"SUMIF('00 Aggregatore'!$B:$B,'00 CE'!$E263,'00 Aggregatore'!F:F)","v":6110953.9000000004}]
[null,"BA1600","B.2.B.1.3)   Mensa",null,"BA1600",{"$f":"SUMIF('00 Aggregatore'!$B:$B,'00 CE'!$E264,'00 Aggregatore'!E:E)","v":4117793.49},{"$f":"SUMIF('00 Aggregatore'!$B:$B,'00 CE'!$E264,'00 Aggregatore'!F:F)","v":4253494.91}]
[null,"BA1610","B.2.B.1.4)   Riscaldamento",null,"BA1610",{"$f":"SUMIF('00 Aggregatore'!$B:$B,'00 CE'!$E265,'00 Aggregatore'!E:E)","v":1064233.96},{"$f":"SUMIF('00 Aggregatore'!$B:$B,'00 CE'!$E265,'00 Aggregatore'!F:F)","v":912590.81}]
[null,"BA1620","B.2.B.1.5)   Servizi di assistenza informatica",null,"BA1620",{"$f":"SUMIF('00 Aggregatore'!$B:$B,'00 CE'!$E266,'00 Aggregatore'!E:E)","v":1666759.65},{"$f":"SUMIF('00 Aggregatore'!$B:$B,'00 CE'!$E266,'00 Aggregatore'!F:F)","v":1812783.81}]
[null,"BA1630","B.2.B.1.6)   Servizi trasporti (non sanitari)",null,"BA1630",{"$f":"SUMIF('00 Aggregatore'!$B:$B,'00 CE'!$E267,'00 Aggregatore'!E:E)","v":9272},{"$f":"SUMIF('00 Aggregatore'!$B:$B,'00 CE'!$E267,'00 Aggregatore'!F:F)","v":5892.6}]
[null,"BA1640","B.2.B.1.7)   Smaltimento rifiuti",null,"BA1640",{"$f":"SUMIF('00 Aggregatore'!$B:$B,'00 CE'!$E268,'00 Aggregatore'!E:E)","v":1384638.6300000001},{"$f":"SUMIF('00 Aggregatore'!$B:$B,'00 CE'!$E268,'00 Aggregatore'!F:F)","v":1392025.82}]
[null,"BA1650","B.2.B.1.8)   Utenze telefoniche",null,"BA1650",{"$f":"SUMIF('00 Aggregatore'!$B:$B,'00 CE'!$E269,'00 Aggregatore'!E:E)","v":524835.69999999995},{"$f":"SUMIF('00 Aggregatore'!$B:$B,'00 CE'!$E269,'00 Aggregatore'!F:F)","v":940270.67}]
[null,"BA1660","B.2.B.1.9)   Utenze elettricità",null,"BA1660",{"$f":"SUMIF('00 Aggregatore'!$B:$B,'00 CE'!$E270,'00 Aggregatore'!E:E)","v":3156167.9},{"$f":"SUMIF('00 Aggregatore'!$B:$B,'00 CE'!$E270,'00 Aggregatore'!F:F)","v":3337366.78}]
[null,"BA1670","B.2.B.1.10)   Altre utenze",null,"BA1670",{"$f":"SUMIF('00 Aggregatore'!$B:$B,'00 CE'!$E271,'00 Aggregatore'!E:E)","v":705877.73},{"$f":"SUMIF('00 Aggregatore'!$B:$B,'00 CE'!$E271,'00 Aggregatore'!F:F)","v":875740.52}]
[null,"BA1680","B.2.B.1.11)  Premi di assicurazione","S","BA1680",{"$f":"SUM(F273:F274)","v":4810016.04},{"$f":"SUM(G273:G274)","v":4728617.0999999996}]
[null,"BA1690","B.2.B.1.11.A)  Premi di assicurazione - R.C. Professionale ",null,"BA1690",{"$f":"SUMIF('00 Aggregatore'!$B:$B,'00 CE'!$E273,'00 Aggregatore'!E:E)","v":4466553.17},{"$f":"SUMIF('00 Aggregatore'!$B:$B,'00 CE'!$E273,'00 Aggregatore'!F:F)","v":4450699.8499999996}]
[null,"BA1700","B.2.B.1.11.B)  Premi di assicurazione - Altri premi assicurativi",null,"BA1700",{"$f":"SUMIF('00 Aggregatore'!$B:$B,'00 CE'!$E274,'00 Aggregatore'!E:E)","v":343462.87},{"$f":"SUMIF('00 Aggregatore'!$B:$B,'00 CE'!$E274,'00 Aggregatore'!F:F)","v":277917.25}]
[null,"BA1710","B.2.B.1.12) Altri servizi non sanitari","S","BA1710",{"$f":"SUM(F276:F278)","v":6734788.6000000006},{"$f":"SUM(G276:G278)","v":6621405.9100000001}]
[null,"BA1720","B.2.B.1.12.A) Altri servizi non sanitari da pubblico (Aziende sanitarie pubbliche della Regione)",null,"BA1720",{"$f":"SUMIF('00 Aggregatore'!$B:$B,'00 CE'!$E276,'00 Aggregatore'!E:E)","v":0},{"$f":"SUMIF('00 Aggregatore'!$B:$B,'00 CE'!$E276,'00 Aggregatore'!F:F)","v":0}]
[null,"BA1730","B.2.B.1.12.B) Altri servizi non sanitari da altri soggetti pubblici",null,"BA1730",{"$f":"SUMIF('00 Aggregatore'!$B:$B,'00 CE'!$E277,'00 Aggregatore'!E:E)","v":0},{"$f":"SUMIF('00 Aggregatore'!$B:$B,'00 CE'!$E277,'00 Aggregatore'!F:F)","v":0}]
[null,"BA1740","B.2.B.1.12.C) Altri servizi non sanitari da privato",null,"BA1740",{"$f":"SUMIF('00 Aggregatore'!$B:$B,'00 CE'!$E278,'00 Aggregatore'!E:E)","v":6734788.6000000006},{"$f":"SUMIF('00 Aggregatore'!$B:$B,'00 CE'!$E278,'00 Aggregatore'!F:F)","v":6621405.9100000001}]
[null,"BA1750","B.2.B.2)  Consulenze, Collaborazioni, Interinale e altre prestazioni di lavoro non sanitarie","S","BA1750",{"$f":"SUM(F280:F282)+F288","v":649624.89999999991},{"$f":"SUM(G280:G282)+G288","v":592002.4}]
[null,"BA1760","B.2.B.2.1) Consulenze non sanitarie da Aziende sanitarie pubbliche della Regione",null,"BA1760",{"$f":"SUMIF('00 Aggregatore'!$B:$B,'00 CE'!$E280,'00 Aggregatore'!E:E)","v":0},{"$f":"SUMIF('00 Aggregatore'!$B:$B,'00 CE'!$E280,'00 Aggregatore'!F:F)","v":0}]
[null,"BA1770","B.2.B.2.2) Consulenze non sanitarie da Terzi - Altri soggetti pubblici",null,"BA1770",{"$f":"SUMIF('00 Aggregatore'!$B:$B,'00 CE'!$E281,'00 Aggregatore'!E:E)","v":0},{"$f":"SUMIF('00 Aggregatore'!$B:$B,'00 CE'!$E281,'00 Aggregatore'!F:F)","v":0}]
[null,"BA1780","B.2.B.2.3) Consulenze, Collaborazioni, Interinale e altre prestazioni di lavoro non sanitarie da privato","S","BA1780",{"$f":"SUM(F283:F287)","v":649624.89999999991},{"$f":"SUM(G283:G287)","v":592002.4}]
[null,"BA1790","B.2.B.2.3.A) Consulenze non sanitarie da privato",null,"BA1790",{"$f":"SUMIF('00 Aggregatore'!$B:$B,'00 CE'!$E283,'00 Aggregatore'!E:E)","v":518707.44999999995},{"$f":"SUMIF('00 Aggregatore'!$B:$B,'00 CE'!$E283,'00 Aggregatore'!F:F)","v":432526.65}]
[null,"BA1800","B.2.B.2.3.B) Collaborazioni coordinate e continuative non sanitarie da privato",null,"BA1800",{"$f":"SUMIF('00 Aggregatore'!$B:$B,'00 CE'!$E284,'00 Aggregatore'!E:E)","v":13535.39},{"$f":"SUMIF('00 Aggregatore'!$B:$B,'00 CE'!$E284,'00 Aggregatore'!F:F)","v":31178.34}]
[null,"BA1810","B.2.B.2.3.C) Indennità a personale universitario - area non sanitaria ",null,"BA1810",{"$f":"SUMIF('00 Aggregatore'!$B:$B,'00 CE'!$E285,'00 Aggregatore'!E:E)","v":0},{"$f":"SUMIF('00 Aggregatore'!$B:$B,'00 CE'!$E285,'00 Aggregatore'!F:F)","v":0}]
[null,"BA1820","B.2.B.2.3.D) Lavoro interinale - area non sanitaria ",null,"BA1820",{"$f":"SUMIF('00 Aggregatore'!$B:$B,'00 CE'!$E286,'00 Aggregatore'!E:E)","v":0},{"$f":"SUMIF('00 Aggregatore'!$B:$B,'00 CE'!$E286,'00 Aggregatore'!F:F)","v":0}]
[null,"BA1830","B.2.B.2.3.E) Altre collaborazioni e prestazioni di lavoro - area non sanitaria ",null,"BA1830",{"$f":"SUMIF('00 Aggregatore'!$B:$B,'00 CE'!$E287,'00 Aggregatore'!E:E)","v":117382.06},{"$f":"SUMIF('00 Aggregatore'!$B:$B,'00 CE'!$E287,'00 Aggregatore'!F:F)","v":128297.41}]
[null,"BA1840","B.2.B.2.4) Rimborso oneri stipendiali del personale non sanitario in comando","S","BA1840",{"$f":"SUM(F289:F291)","v":0},{"$f":"SUM(G289:G291)","v":0}]
[null,"BA1850","B.2.B.2.4.A) Rimborso oneri stipendiali personale non sanitario in comando da Aziende sanitarie pubbliche della Regione",null,"BA1850",{"$f":"SUMIF('00 Aggregatore'!$B:$B,'00 CE'!$E289,'00 Aggregatore'!E:E)","v":0},{"$f":"SUMIF('00 Aggregatore'!$B:$B,'00 CE'!$E289,'00 Aggregatore'!F:F)","v":0}]
[null,"BA1860","B.2.B.2.4.B) Rimborso oneri stipendiali personale non sanitario in comando da Regione, soggetti pubblici e da Università",null,"BA1860",{"$f":"SUMIF('00 Aggregatore'!$B:$B,'00 CE'!$E290,'00 Aggregatore'!E:E)","v":0},{"$f":"SUMIF('00 Aggregatore'!$B:$B,'00 CE'!$E290,'00 Aggregatore'!F:F)","v":0}]
[null,"BA1870","B.2.B.2.4.C) Rimborso oneri stipendiali personale non sanitario in comando da aziende di altre Regioni (Extraregione)",null,"BA1870",{"$f":"SUMIF('00 Aggregatore'!$B:$B,'00 CE'!$E291,'00 Aggregatore'!E:E)","v":0},{"$f":"SUMIF('00 Aggregatore'!$B:$B,'00 CE'!$E291,'00 Aggregatore'!F:F)","v":0}]
[null,"BA1880","B.2.B.3) Formazione (esternalizzata e non)","S","BA1880",{"$f":"SUM(F293:F294)","v":597344.22},{"$f":"SUM(G293:G294)","v":661265.06999999995}]
[null,"BA1890","B.2.B.3.1) Formazione (esternalizzata e non) da pubblico",null,"BA1890",{"$f":"SUMIF('00 Aggregatore'!$B:$B,'00 CE'!$E293,'00 Aggregatore'!E:E)","v":81237.64},{"$f":"SUMIF('00 Aggregatore'!$B:$B,'00 CE'!$E293,'00 Aggregatore'!F:F)","v":35012.980000000003}]
[null,"BA1900","B.2.B.3.2) Formazione (esternalizzata e non) da privato",null,"BA1900",{"$f":"SUMIF('00 Aggregatore'!$B:$B,'00 CE'!$E294,'00 Aggregatore'!E:E)","v":516106.58},{"$f":"SUMIF('00 Aggregatore'!$B:$B,'00 CE'!$E294,'00 Aggregatore'!F:F)","v":626252.09}]
[null,"BA1910","B.3)  Manutenzione e riparazione (ordinaria esternalizzata)","S","BA1910",{"$f":"SUM(F296:F302)","v":15729686.23},{"$f":"SUM(G296:G302)","v":15710849.98}]
[null,"BA1920","B.3.A)  Manutenzione e riparazione ai fabbricati e loro pertinenze",null,"BA1920",{"$f":"SUMIF('00 Aggregatore'!$B:$B,'00 CE'!$E296,'00 Aggregatore'!E:E)","v":9244877.5800000001},{"$f":"SUMIF('00 Aggregatore'!$B:$B,'00 CE'!$E296,'00 Aggregatore'!F:F)","v":8571730.1999999993}]
[null,"BA1930","B.3.B)  Manutenzione e riparazione agli impianti e macchinari",null,"BA1930",{"$f":"SUMIF('00 Aggregatore'!$B:$B,'00 CE'!$E297,'00 Aggregatore'!E:E)","v":0},{"$f":"SUMIF('00 Aggregatore'!$B:$B,'00 CE'!$E297,'00 Aggregatore'!F:F)","v":0}]
[null,"BA1940","B.3.C)  Manutenzione e riparazione alle attrezzature sanitarie e scientifiche",null,"BA1940",{"$f":"SUMIF('00 Aggregatore'!$B:$B,'00 CE'!$E298,'00 Aggregatore'!E:E)","v":5502395.79},{"$f":"SUMIF('00 Aggregatore'!$B:$B,'00 CE'!$E298,'00 Aggregatore'!F:F)","v":6129147.0499999998}]
[null,"BA1950","B.3.D)  Manutenzione e riparazione ai mobili e arredi",null,"BA1950",{"$f":"SUMIF('00 Aggregatore'!$B:$B,'00 CE'!$E299,'00 Aggregatore'!E:E)","v":0},{"$f":"SUMIF('00 Aggregatore'!$B:$B,'00 CE'!$E299,'00 Aggregatore'!F:F)","v":0}]
[null,"BA1960","B.3.E)  Manutenzione e riparazione agli automezzi",null,"BA1960",{"$f":"SUMIF('00 Aggregatore'!$B:$B,'00 CE'!$E300,'00 Aggregatore'!E:E)","v":109400.27},{"$f":"SUMIF('00 Aggregatore'!$B:$B,'00 CE'!$E300,'00 Aggregatore'!F:F)","v":125986.4}]
[null,"BA1970","B.3.F)  Altre manutenzioni e riparazioni",null,"BA1970",{"$f":"SUMIF('00 Aggregatore'!$B:$B,'00 CE'!$E301,'00 Aggregatore'!E:E)","v":873012.59},{"$f":"SUMIF('00 Aggregatore'!$B:$B,'00 CE'!$E301,'00 Aggregatore'!F:F)","v":883986.33}]
[null,"BA1980","B.3.G)  Manutenzioni e riparazioni da Aziende sanitarie pubbliche della Regione",null,"BA1980",{"$f":"SUMIF('00 Aggregatore'!$B:$B,'00 CE'!$E302,'00 Aggregatore'!E:E)","v":0},{"$f":"SUMIF('00 Aggregatore'!$B:$B,'00 CE'!$E302,'00 Aggregatore'!F:F)","v":0}]
[null,"BA1990","B.4)   Godimento di beni di terzi","S","BA1990",{"$f":"F304+F305+F308+F311","v":6492272.2400000002},{"$f":"G304+G305+G308+G311","v":6776482.79}]
[null,"BA2000","B.4.A)  Fitti passivi",null,"BA2000",{"$f":"SUMIF('00 Aggregatore'!$B:$B,'00 CE'!$E304,'00 Aggregatore'!E:E)","v":1239352.47},{"$f":"SUMIF('00 Aggregatore'!$B:$B,'00 CE'!$E304,'00 Aggregatore'!F:F)","v":1330887.46}]
[null,"BA2010","B.4.B)  Canoni di noleggio","S","BA2010",{"$f":"SUM(F306:F307)","v":5252919.7700000005},{"$f":"SUM(G306:G307)","v":5445595.3300000001}]
[null,"BA2020","B.4.B.1) Canoni di noleggio - area sanitaria",null,"BA2020",{"$f":"SUMIF('00 Aggregatore'!$B:$B,'00 CE'!$E306,'00 Aggregatore'!E:E)","v":4790860.33},{"$f":"SUMIF('00 Aggregatore'!$B:$B,'00 CE'!$E306,'00 Aggregatore'!F:F)","v":5015627.3600000003}]
[null,"BA2030","B.4.B.2) Canoni di noleggio - area non sanitaria",null,"BA2030",{"$f":"SUMIF('00 Aggregatore'!$B:$B,'00 CE'!$E307,'00 Aggregatore'!E:E)","v":462059.44},{"$f":"SUMIF('00 Aggregatore'!$B:$B,'00 CE'!$E307,'00 Aggregatore'!F:F)","v":429967.97}]
[null,"BA2040","B.4.C)  Canoni di leasing","S","BA2040",{"$f":"SUM(F309:F310)","v":0},{"$f":"SUM(G309:G310)","v":0}]
[null,"BA2050","B.4.C.1) Canoni di leasing - area sanitaria",null,"BA2050",{"$f":"SUMIF('00 Aggregatore'!$B:$B,'00 CE'!$E309,'00 Aggregatore'!E:E)","v":0},{"$f":"SUMIF('00 Aggregatore'!$B:$B,'00 CE'!$E309,'00 Aggregatore'!F:F)","v":0}]
[null,"BA2060","B.4.C.2) Canoni di leasing - area non sanitaria",null,"BA2060",{"$f":"SUMIF('00 Aggregatore'!$B:$B,'00 CE'!$E310,'00 Aggregatore'!E:E)","v":0},{"$f":"SUMIF('00 Aggregatore'!$B:$B,'00 CE'!$E310,'00 Aggregatore'!F:F)","v":0}]
[null,"BA2070","B.4.D)  Locazioni e noleggi da Aziende sanitarie pubbliche della Regione",null,"BA2070",{"$f":"SUMIF('00 Aggregatore'!$B:$B,'00 CE'!$E311,'00 Aggregatore'!E:E)","v":0},{"$f":"SUMIF('00 Aggregatore'!$B:$B,'00 CE'!$E311,'00 Aggregatore'!F:F)","v":0}]
[null,"BA2080","Totale Costo del personale","S","BA2080",{"$f":"F313+F327+F336+F345","v":165244202.44},{"$f":"G313+G327+G336+G345","v":167875561.59}]
[null,"BA2090","B.5)   Personale del ruolo sanitario","S","BA2090",{"$f":"F314+F323","v":138175218.69},{"$f":"G314+G323","v":139820551.13999999}]
[null,"BA2100","B.5.A) Costo del personale dirigente ruolo sanitario","S","BA2100",{"$f":"F315+F319","v":73318273.719999999},{"$f":"G315+G319","v":72571422.890000001}]
[null,"BA2110","B.5.A.1) Costo del personale dirigente medico","S","BA2110",{"$f":"SUM(F316:F318)","v":68148859.189999998},{"$f":"SUM(G316:G318)","v":67351870.719999999}]
[null,"BA2120","B.5.A.1.1) Costo del personale dirigente medico - tempo indeterminato",null,"BA2120",{"$f":"SUMIF('00 Aggregatore'!$B:$B,'00 CE'!$E316,'00 Aggregatore'!E:E)","v":66243178.869999997},{"$f":"SUMIF('00 Aggregatore'!$B:$B,'00 CE'!$E316,'00 Aggregatore'!F:F)","v":64319241.780000001}]
[null,"BA2130","B.5.A.1.2) Costo del personale dirigente medico - tempo determinato",null,"BA2130",{"$f":"SUMIF('00 Aggregatore'!$B:$B,'00 CE'!$E317,'00 Aggregatore'!E:E)","v":1905680.32},{"$f":"SUMIF('00 Aggregatore'!$B:$B,'00 CE'!$E317,'00 Aggregatore'!F:F)","v":3032628.94}]
[null,"BA2140","B.5.A.1.3) Costo del personale dirigente medico - altro",null,"BA2140",{"$f":"SUMIF('00 Aggregatore'!$B:$B,'00 CE'!$E318,'00 Aggregatore'!E:E)","v":0},{"$f":"SUMIF('00 Aggregatore'!$B:$B,'00 CE'!$E318,'00 Aggregatore'!F:F)","v":0}]
[null,"BA2150","B.5.A.2) Costo del personale dirigente non medico","S","BA2150",{"$f":"SUM(F320:F322)","v":5169414.5299999993},{"$f":"SUM(G320:G322)","v":5219552.17}]
[null,"BA2160","B.5.A.2.1) Costo del personale dirigente non medico - tempo indeterminato",null,"BA2160",{"$f":"SUMIF('00 Aggregatore'!$B:$B,'00 CE'!$E320,'00 Aggregatore'!E:E)","v":5064518.01},{"$f":"SUMIF('00 Aggregatore'!$B:$B,'00 CE'!$E320,'00 Aggregatore'!F:F)","v":4831272.49}]
[null,"BA2170","B.5.A.2.2) Costo del personale dirigente non medico - tempo determinato",null,"BA2170",{"$f":"SUMIF('00 Aggregatore'!$B:$B,'00 CE'!$E321,'00 Aggregatore'!E:E)","v":104896.52000000002},{"$f":"SUMIF('00 Aggregatore'!$B:$B,'00 CE'!$E321,'00 Aggregatore'!F:F)","v":388279.68}]
[null,"BA2180","B.5.A.2.3) Costo del personale dirigente non medico - altro",null,"BA2180",{"$f":"SUMIF('00 Aggregatore'!$B:$B,'00 CE'!$E322,'00 Aggregatore'!E:E)","v":0},{"$f":"SUMIF('00 Aggregatore'!$B:$B,'00 CE'!$E322,'00 Aggregatore'!F:F)","v":0}]
[null,"BA2190","B.5.B) Costo del personale comparto ruolo sanitario","S","BA2190",{"$f":"SUM(F324:F326)","v":64856944.969999991},{"$f":"SUM(G324:G326)","v":67249128.25}]
[null,"BA2200","B.5.B.1) Costo del personale comparto ruolo sanitario - tempo indeterminato",null,"BA2200",{"$f":"SUMIF('00 Aggregatore'!$B:$B,'00 CE'!$E324,'00 Aggregatore'!E:E)","v":64044509.309999995},{"$f":"SUMIF('00 Aggregatore'!$B:$B,'00 CE'!$E324,'00 Aggregatore'!F:F)","v":65514162.510000005}]
[null,"BA2210","B.5.B.2) Costo del personale comparto ruolo sanitario - tempo determinato",null,"BA2210",{"$f":"SUMIF('00 Aggregatore'!$B:$B,'00 CE'!$E325,'00 Aggregatore'!E:E)","v":812435.66},{"$f":"SUMIF('00 Aggregatore'!$B:$B,'00 CE'!$E325,'00 Aggregatore'!F:F)","v":1734965.7400000002}]
[null,"BA2220","B.5.B.3) Costo del personale comparto ruolo sanitario - altro",null,"BA2220",{"$f":"SUMIF('00 Aggregatore'!$B:$B,'00 CE'!$E326,'00 Aggregatore'!E:E)","v":0},{"$f":"SUMIF('00 Aggregatore'!$B:$B,'00 CE'!$E326,'00 Aggregatore'!F:F)","v":0}]
[null,"BA2230","B.6)   Personale del ruolo professionale","S","BA2230",{"$f":"F328+F332","v":438201.74},{"$f":"G328+G332","v":438861.05999999994}]
[null,"BA2240","B.6.A) Costo del personale dirigente ruolo professionale","S","BA2240",{"$f":"SUM(F329:F331)","v":425798.17},{"$f":"SUM(G329:G331)","v":437281.32999999996}]
[null,"BA2250","B.6.A.1) Costo del personale dirigente ruolo professionale - tempo indeterminato",null,"BA2250",{"$f":"SUMIF('00 Aggregatore'!$B:$B,'00 CE'!$E329,'00 Aggregatore'!E:E)","v":404674.32},{"$f":"SUMIF('00 Aggregatore'!$B:$B,'00 CE'!$E329,'00 Aggregatore'!F:F)","v":367654.11}]
[null,"BA2260","B.6.A.2) Costo del personale dirigente ruolo professionale - tempo determinato",null,"BA2260",{"$f":"SUMIF('00 Aggregatore'!$B:$B,'00 CE'!$E330,'00 Aggregatore'!E:E)","v":21123.85},{"$f":"SUMIF('00 Aggregatore'!$B:$B,'00 CE'!$E330,'00 Aggregatore'!F:F)","v":69627.22}]
[null,"BA2270","B.6.A.3) Costo del personale dirigente ruolo professionale - altro",null,"BA2270",{"$f":"SUMIF('00 Aggregatore'!$B:$B,'00 CE'!$E331,'00 Aggregatore'!E:E)","v":0},{"$f":"SUMIF('00 Aggregatore'!$B:$B,'00 CE'!$E331,'00 Aggregatore'!F:F)","v":0}]
[null,"BA2280","B.6.B) Costo del personale comparto ruolo professionale","S","BA2280",{"$f":"SUM(F333:F335)","v":12403.57},{"$f":"SUM(G333:G335)","v":1579.73}]
[null,"BA2290","B.6.B.1) Costo del personale comparto ruolo professionale - tempo indeterminato",null,"BA2290",{"$f":"SUMIF('00 Aggregatore'!$B:$B,'00 CE'!$E333,'00 Aggregatore'!E:E)","v":12403.57},{"$f":"SUMIF('00 Aggregatore'!$B:$B,'00 CE'!$E333,'00 Aggregatore'!F:F)","v":1579.73}]
[null,"BA2300","B.6.B.2) Costo del personale comparto ruolo professionale - tempo determinato",null,"BA2300",{"$f":"SUMIF('00 Aggregatore'!$B:$B,'00 CE'!$E334,'00 Aggregatore'!E:E)","v":0},{"$f":"SUMIF('00 Aggregatore'!$B:$B,'00 CE'!$E334,'00 Aggregatore'!F:F)","v":0}]
[null,"BA2310","B.6.B.3) Costo del personale comparto ruolo professionale - altro",null,"BA2310",{"$f":"SUMIF('00 Aggregatore'!$B:$B,'00 CE'!$E335,'00 Aggregatore'!E:E)","v":0},{"$f":"SUMIF('00 Aggregatore'!$B:$B,'00 CE'!$E335,'00 Aggregatore'!F:F)","v":0}]
[null,"BA2320","B.7)   Personale del ruolo tecnico","S","BA2320",{"$f":"F337+F341","v":16516470.15},{"$f":"G337+G341","v":17518842.809999999}]
[null,"BA2330","B.7.A) Costo del personale dirigente ruolo tecnico","S","BA2330",{"$f":"SUM(F338:F340)","v":375739.52999999997},{"$f":"SUM(G338:G340)","v":345702.9}]
[null,"BA2340","B.7.A.1) Costo del personale dirigente ruolo tecnico - tempo indeterminato",null,"BA2340",{"$f":"SUMIF('00 Aggregatore'!$B:$B,'00 CE'!$E338,'00 Aggregatore'!E:E)","v":375739.52999999997},{"$f":"SUMIF('00 Aggregatore'!$B:$B,'00 CE'!$E338,'00 Aggregatore'!F:F)","v":345702.9}]
[null,"BA2350","B.7.A.2) Costo del personale dirigente ruolo tecnico - tempo determinato",null,"BA2350",{"$f":"SUMIF('00 Aggregatore'!$B:$B,'00 CE'!$E339,'00 Aggregatore'!E:E)","v":0},{"$f":"SUMIF('00 Aggregatore'!$B:$B,'00 CE'!$E339,'00 Aggregatore'!F:F)","v":0}]
[null,"BA2360","B.7.A.3) Costo del personale dirigente ruolo tecnico - altro",null,"BA2360",{"$f":"SUMIF('00 Aggregatore'!$B:$B,'00 CE'!$E340,'00 Aggregatore'!E:E)","v":0},{"$f":"SUMIF('00 Aggregatore'!$B:$B,'00 CE'!$E340,'00 Aggregatore'!F:F)","v":0}]
[null,"BA2370","B.7.B) Costo del personale comparto ruolo tecnico","S","BA2370",{"$f":"SUM(F342:F344)","v":16140730.620000001},{"$f":"SUM(G342:G344)","v":17173139.91}]
[null,"BA2380","B.7.B.1) Costo del personale comparto ruolo tecnico - tempo indeterminato",null,"BA2380",{"$f":"SUMIF('00 Aggregatore'!$B:$B,'00 CE'!$E342,'00 Aggregatore'!E:E)","v":15963506.970000001},{"$f":"SUMIF('00 Aggregatore'!$B:$B,'00 CE'!$E342,'00 Aggregatore'!F:F)","v":16881837.510000002}]
[null,"BA2390","B.7.B.2) Costo del personale comparto ruolo tecnico - tempo determinato",null,"BA2390",{"$f":"SUMIF('00 Aggregatore'!$B:$B,'00 CE'!$E343,'00 Aggregatore'!E:E)","v":177223.65000000002},{"$f":"SUMIF('00 Aggregatore'!$B:$B,'00 CE'!$E343,'00 Aggregatore'!F:F)","v":291302.39999999997}]
[null,"BA2400","B.7.B.3) Costo del personale comparto ruolo tecnico - altro",null,"BA2400",{"$f":"SUMIF('00 Aggregatore'!$B:$B,'00 CE'!$E344,'00 Aggregatore'!E:E)","v":0},{"$f":"SUMIF('00 Aggregatore'!$B:$B,'00 CE'!$E344,'00 Aggregatore'!F:F)","v":0}]
[null,"BA2410","B.8)   Personale del ruolo amministrativo","S","BA2410",{"$f":"F346+F350","v":10114311.859999999},{"$f":"G346+G350","v":10097306.58}]
[null,"BA2420","B.8.A) Costo del personale dirigente ruolo amministrativo","S","BA2420",{"$f":"SUM(F347:F349)","v":824224.55},{"$f":"SUM(G347:G349)","v":938060.23}]
[null,"BA2430","B.8.A.1) Costo del personale dirigente ruolo amministrativo - tempo indeterminato",null,"BA2430",{"$f":"SUMIF('00 Aggregatore'!$B:$B,'00 CE'!$E347,'00 Aggregatore'!E:E)","v":824224.55},{"$f":"SUMIF('00 Aggregatore'!$B:$B,'00 CE'!$E347,'00 Aggregatore'!F:F)","v":922464.95}]
[null,"BA2440","B.8.A.2) Costo del personale dirigente ruolo amministrativo - tempo determinato",null,"BA2440",{"$f":"SUMIF('00 Aggregatore'!$B:$B,'00 CE'!$E348,'00 Aggregatore'!E:E)","v":0},{"$f":"SUMIF('00 Aggregatore'!$B:$B,'00 CE'!$E348,'00 Aggregatore'!F:F)","v":15595.28}]
[null,"BA2450","B.8.A.3) Costo del personale dirigente ruolo amministrativo - altro",null,"BA2450",{"$f":"SUMIF('00 Aggregatore'!$B:$B,'00 CE'!$E349,'00 Aggregatore'!E:E)","v":0},{"$f":"SUMIF('00 Aggregatore'!$B:$B,'00 CE'!$E349,'00 Aggregatore'!F:F)","v":0}]
[null,"BA2460","B.8.B) Costo del personale comparto ruolo amministrativo","S","BA2460",{"$f":"SUM(F351:F353)","v":9290087.3099999987},{"$f":"SUM(G351:G353)","v":9159246.3499999996}]
[null,"BA2470","B.8.B.1) Costo del personale comparto ruolo amministrativo - tempo indeterminato",null,"BA2470",{"$f":"SUMIF('00 Aggregatore'!$B:$B,'00 CE'!$E351,'00 Aggregatore'!E:E)","v":9288718.9999999981},{"$f":"SUMIF('00 Aggregatore'!$B:$B,'00 CE'!$E351,'00 Aggregatore'!F:F)","v":9121759.0600000005}]
[null,"BA2480","B.8.B.2) Costo del personale comparto ruolo amministrativo - tempo determinato",null,"BA2480",{"$f":"SUMIF('00 Aggregatore'!$B:$B,'00 CE'!$E352,'00 Aggregatore'!E:E)","v":1368.31},{"$f":"SUMIF('00 Aggregatore'!$B:$B,'00 CE'!$E352,'00 Aggregatore'!F:F)","v":37487.29}]
[null,"BA2490","B.8.B.3) Costo del personale comparto ruolo amministrativo - altro",null,"BA2490",{"$f":"SUMIF('00 Aggregatore'!$B:$B,'00 CE'!$E353,'00 Aggregatore'!E:E)","v":0},{"$f":"SUMIF('00 Aggregatore'!$B:$B,'00 CE'!$E353,'00 Aggregatore'!F:F)","v":0}]
[null,"BA2500","B.9)   Oneri diversi di gestione","S","BA2500",{"$f":"SUM(F355:F357)","v":2884146.3600000003},{"$f":"SUM(G355:G357)","v":2837998.5}]
[null,"BA2510","B.9.A)  Imposte e tasse (escluso IRAP e IRES)",null,"BA2510",{"$f":"SUMIF('00 Aggregatore'!$B:$B,'00 CE'!$E355,'00 Aggregatore'!E:E)","v":1160574.8},{"$f":"SUMIF('00 Aggregatore'!$B:$B,'00 CE'!$E355,'00 Aggregatore'!F:F)","v":1247157.1599999999}]
[null,"BA2520","B.9.B)  Perdite su crediti",null,"BA2520",{"$f":"SUMIF('00 Aggregatore'!$B:$B,'00 CE'!$E356,'00 Aggregatore'!E:E)","v":0},{"$f":"SUMIF('00 Aggregatore'!$B:$B,'00 CE'!$E356,'00 Aggregatore'!F:F)","v":0}]
[null,"BA2530","B.9.C) Altri oneri diversi di gestione","S","BA2530",{"$f":"SUM(F358:F359)","v":1723571.56},{"$f":"SUM(G358:G359)","v":1590841.34}]
[null,"BA2540","B.9.C.1)  Indennità, rimborso spese e oneri sociali per gli Organi Direttivi e Collegio Sindacale",null,"BA2540",{"$f":"SUMIF('00 Aggregatore'!$B:$B,'00 CE'!$E358,'00 Aggregatore'!E:E)","v":1430687.1400000001},{"$f":"SUMIF('00 Aggregatore'!$B:$B,'00 CE'!$E358,'00 Aggregatore'!F:F)","v":1338906.02}]
[null,"BA2550","B.9.C.2)  Altri oneri diversi di gestione",null,"BA2550",{"$f":"SUMIF('00 Aggregatore'!$B:$B,'00 CE'!$E359,'00 Aggregatore'!E:E)","v":292884.42000000004},{"$f":"SUMIF('00 Aggregatore'!$B:$B,'00 CE'!$E359,'00 Aggregatore'!F:F)","v":251935.31999999998}]
[null,"BA2560","Totale Ammortamenti","S","BA2560",{"$f":"SUM(F361:F362)","v":10262377.760000002},{"$f":"SUM(G361:G362)","v":10881437.840000002}]
[null,"BA2570","B.10) Ammortamenti delle immobilizzazioni immateriali",null,"BA2570",{"$f":"SUMIF('00 Aggregatore'!$B:$B,'00 CE'!$E361,'00 Aggregatore'!E:E)","v":136552.39000000001},{"$f":"SUMIF('00 Aggregatore'!$B:$B,'00 CE'!$E361,'00 Aggregatore'!F:F)","v":160938.81}]
[null,"BA2580","B.11) Ammortamenti delle immobilizzazioni materiali","S","BA2580",{"$f":"F363+F366","v":10125825.370000001},{"$f":"G363+G366","v":10720499.030000001}]
[null,"BA2590","B.12) Ammortamento dei fabbricati","S","BA2590",{"$f":"SUM(F364:F365)","v":4970287.05},{"$f":"SUM(G364:G365)","v":4970458.6100000003}]
[null,"BA2600","B.12.A) Ammortamenti fabbricati non strumentali (disponibili)",null,"BA2600",{"$f":"SUMIF('00 Aggregatore'!$B:$B,'00 CE'!$E364,'00 Aggregatore'!E:E)","v":0},{"$f":"SUMIF('00 Aggregatore'!$B:$B,'00 CE'!$E364,'00 Aggregatore'!F:F)","v":0}]
[null,"BA2610","B.12.B) Ammortamenti fabbricati strumentali (indisponibili)",null,"BA2610",{"$f":"SUMIF('00 Aggregatore'!$B:$B,'00 CE'!$E365,'00 Aggregatore'!E:E)","v":4970287.05},{"$f":"SUMIF('00 Aggregatore'!$B:$B,'00 CE'!$E365,'00 Aggregatore'!F:F)","v":4970458.6100000003}]
[null,"BA2620","B.13) Ammortamenti delle altre immobilizzazioni materiali",null,"BA2620",{"$f":"SUMIF('00 Aggregatore'!$B:$B,'00 CE'!$E366,'00 Aggregatore'!E:E)","v":5155538.32},{"$f":"SUMIF('00 Aggregatore'!$B:$B,'00 CE'!$E366,'00 Aggregatore'!F:F)","v":5750040.4199999999}]
[null,"BA2630","B.14) Svalutazione delle immobilizzazioni e dei crediti","S","BA2630",{"$f":"SUM(F368:F369)","v":0},{"$f":"SUM(G368:G369)","v":0}]
[null,"BA2640","B.14.A) Svalutazione delle immobilizzazioni immateriali e materiali",null,"BA2640",{"$f":"SUMIF('00 Aggregatore'!$B:$B,'00 CE'!$E368,'00 Aggregatore'!E:E)","v":0},{"$f":"SUMIF('00 Aggregatore'!$B:$B,'00 CE'!$E368,'00 Aggregatore'!F:F)","v":0}]
[null,"BA2650","B.14.B) Svalutazione dei crediti",null,"BA2650",{"$f":"SUMIF('00 Aggregatore'!$B:$B,'00 CE'!$E369,'00 Aggregatore'!E:E)","v":0},{"$f":"SUMIF('00 Aggregatore'!$B:$B,'00 CE'!$E369,'00 Aggregatore'!F:F)","v":0}]
[null,"BA2660","B.15) Variazione delle rimanenze","S","BA2660",{"$f":"SUM(F371:F372)","v":-1222094.4500000007},{"$f":"SUM(G371:G372)","v":-5011001.5599999996}]
[null,"BA2670","B.15.A) Variazione rimanenze sanitarie",null,"BA2670",{"$f":"SUMIF('00 Aggregatore'!$B:$B,'00 CE'!$E371,'00 Aggregatore'!E:E)","v":-1167703.8400000005},{"$f":"SUMIF('00 Aggregatore'!$B:$B,'00 CE'!$E371,'00 Aggregatore'!F:F)","v":-5123500.2699999996}]
[null,"BA2680","B.15.B) Variazione rimanenze non sanitarie",null,"BA2680",{"$f":"SUMIF('00 Aggregatore'!$B:$B,'00 CE'!$E372,'00 Aggregatore'!E:E)","v":-54390.610000000037},{"$f":"SUMIF('00 Aggregatore'!$B:$B,'00 CE'!$E372,'00 Aggregatore'!F:F)","v":112498.70999999998}]
[null,"BA2690","B.16) Accantonamenti dell’esercizio","S","BA2690",{"$f":"F374+F380+F381+F386","v":27470627.169999998},{"$f":"G374+G380+G381+G386","v":18229040.560000002}]
[null,"BA2700","B.16.A) Accantonamenti per rischi","S","BA2700",{"$f":"SUM(F375:F379)","v":17301441.66},{"$f":"SUM(G375:G379)","v":3927713.96}]
[null,"BA2710","B.16.A.1)  Accantonamenti per cause civili ed oneri processuali",null,"BA2710",{"$f":"SUMIF('00 Aggregatore'!$B:$B,'00 CE'!$E375,'00 Aggregatore'!E:E)","v":9268206.2400000002},{"$f":"SUMIF('00 Aggregatore'!$B:$B,'00 CE'!$E375,'00 Aggregatore'!F:F)","v":1357811.38}]
[null,"BA2720","B.16.A.2)  Accantonamenti per contenzioso personale dipendente",null,"BA2720",{"$f":"SUMIF('00 Aggregatore'!$B:$B,'00 CE'!$E376,'00 Aggregatore'!E:E)","v":562892.11},{"$f":"SUMIF('00 Aggregatore'!$B:$B,'00 CE'!$E376,'00 Aggregatore'!F:F)","v":0}]
[null,"BA2730","B.16.A.3)  Accantonamenti per rischi connessi all'acquisto di prestazioni sanitarie da privato",null,"BA2730",{"$f":"SUMIF('00 Aggregatore'!$B:$B,'00 CE'!$E377,'00 Aggregatore'!E:E)","v":4358962},{"$f":"SUMIF('00 Aggregatore'!$B:$B,'00 CE'!$E377,'00 Aggregatore'!F:F)","v":272176.8}]
[null,"BA2740","B.16.A.4)  Accantonamenti per copertura diretta dei rischi (autoassicurazione)",null,"BA2740",{"$f":"SUMIF('00 Aggregatore'!$B:$B,'00 CE'!$E378,'00 Aggregatore'!E:E)","v":3111381.31},{"$f":"SUMIF('00 Aggregatore'!$B:$B,'00 CE'!$E378,'00 Aggregatore'!F:F)","v":2297725.7799999998}]
[null,"BA2750","B.16.A.5)  Altri accantonamenti per rischi",null,"BA2750",{"$f":"SUMIF('00 Aggregatore'!$B:$B,'00 CE'!$E379,'00 Aggregatore'!E:E)","v":0},{"$f":"SUMIF('00 Aggregatore'!$B:$B,'00 CE'!$E379,'00 Aggregatore'!F:F)","v":0}]
[null,"BA2760","B.16.B) Accantonamenti per premio di operosità (SUMAI)",null,"BA2760",{"$f":"SUMIF('00 Aggregatore'!$B:$B,'00 CE'!$E380,'00 Aggregatore'!E:E)","v":223015.56},{"$f":"SUMIF('00 Aggregatore'!$B:$B,'00 CE'!$E380,'00 Aggregatore'!F:F)","v":264664.11}]
[null,"BA2770","B.16.C) Accantonamenti per quote inutilizzate di contributi vincolati","S","BA2770",{"$f":"SUM(F382:F385)","v":7068429.9500000002},{"$f":"SUM(G382:G385)","v":7269835.4900000002}]
[null,"BA2780","B.16.C.1)  Accantonamenti per quote inutilizzate contributi da Regione e Prov. Aut. per quota F.S. vincolato",null,"BA2780",{"$f":"SUMIF('00 Aggregatore'!$B:$B,'00 CE'!$E382,'00 Aggregatore'!E:E)","v":7018127.5499999998},{"$f":"SUMIF('00 Aggregatore'!$B:$B,'00 CE'!$E382,'00 Aggregatore'!F:F)","v":7216729.6299999999}]
[null,"BA2790","B.16.C.2)  Accantonamenti per quote inutilizzate contributi da soggetti pubblici (extra fondo) vincolati",null,"BA2790",{"$f":"SUMIF('00 Aggregatore'!$B:$B,'00 CE'!$E383,'00 Aggregatore'!E:E)","v":50302.400000000001},{"$f":"SUMIF('00 Aggregatore'!$B:$B,'00 CE'!$E383,'00 Aggregatore'!F:F)","v":53105.86}]
[null,"BA2800","B.16.C.3)  Accantonamenti per quote inutilizzate contributi da soggetti pubblici per ricerca",null,"BA2800",{"$f":"SUMIF('00 Aggregatore'!$B:$B,'00 CE'!$E384,'00 Aggregatore'!E:E)","v":0},{"$f":"SUMIF('00 Aggregatore'!$B:$B,'00 CE'!$E384,'00 Aggregatore'!F:F)","v":0}]
[null,"BA2810","B.16.C.4)  Accantonamenti per quote inutilizzate contributi vincolati da privati",null,"BA2810",{"$f":"SUMIF('00 Aggregatore'!$B:$B,'00 CE'!$E385,'00 Aggregatore'!E:E)","v":0},{"$f":"SUMIF('00 Aggregatore'!$B:$B,'00 CE'!$E385,'00 Aggregatore'!F:F)","v":0}]
[null,"BA2820","B.16.D) Altri accantonamenti","S","BA2820",{"$f":"SUM(F387:F393)","v":2877740},{"$f":"SUM(G387:G393)","v":6766827}]
[null,"BA2830","B.16.D.1)  Accantonamenti per interessi di mora",null,"BA2830",{"$f":"SUMIF('00 Aggregatore'!$B:$B,'00 CE'!$E387,'00 Aggregatore'!E:E)","v":0},{"$f":"SUMIF('00 Aggregatore'!$B:$B,'00 CE'!$E387,'00 Aggregatore'!F:F)","v":0}]
[null,"BA2840","B.16.D.2)  Acc. Rinnovi convenzioni MMG/PLS/MCA",null,"BA2840",{"$f":"SUMIF('00 Aggregatore'!$B:$B,'00 CE'!$E388,'00 Aggregatore'!E:E)","v":653733},{"$f":"SUMIF('00 Aggregatore'!$B:$B,'00 CE'!$E388,'00 Aggregatore'!F:F)","v":1507157}]
[null,"BA2850","B.16.D.3)  Acc. Rinnovi convenzioni Medici Sumai",null,"BA2850",{"$f":"SUMIF('00 Aggregatore'!$B:$B,'00 CE'!$E389,'00 Aggregatore'!E:E)","v":82934},{"$f":"SUMIF('00 Aggregatore'!$B:$B,'00 CE'!$E389,'00 Aggregatore'!F:F)","v":200998}]
[null,"BA2860","B.16.D.4)  Acc. Rinnovi contratt.: dirigenza medica",null,"BA2860",{"$f":"SUMIF('00 Aggregatore'!$B:$B,'00 CE'!$E390,'00 Aggregatore'!E:E)","v":757797},{"$f":"SUMIF('00 Aggregatore'!$B:$B,'00 CE'!$E390,'00 Aggregatore'!F:F)","v":2419388}]
[null,"BA2870","B.16.D.5)  Acc. Rinnovi contratt.: dirigenza non medica",null,"BA2870",{"$f":"SUMIF('00 Aggregatore'!$B:$B,'00 CE'!$E391,'00 Aggregatore'!E:E)","v":74949},{"$f":"SUMIF('00 Aggregatore'!$B:$B,'00 CE'!$E391,'00 Aggregatore'!F:F)","v":239284}]
[null,"BA2880","B.16.D.6)  Acc. Rinnovi contratt.: comparto",null,"BA2880",{"$f":"SUMIF('00 Aggregatore'!$B:$B,'00 CE'!$E392,'00 Aggregatore'!E:E)","v":1008327},{"$f":"SUMIF('00 Aggregatore'!$B:$B,'00 CE'!$E392,'00 Aggregatore'!F:F)","v":0}]
[null,"BA2890","B.16.D.7) Altri accantonamenti",null,"BA2890",{"$f":"SUMIF('00 Aggregatore'!$B:$B,'00 CE'!$E393,'00 Aggregatore'!E:E)","v":300000},{"$f":"SUMIF('00 Aggregatore'!$B:$B,'00 CE'!$E393,'00 Aggregatore'!F:F)","v":2400000}]
[null,"BZ9999","Totale costi della produzione (B)","S","BZ9999",{"$f":"F115+F143+F295+F303+F312+F354+F360+F367+F370+F373","v":712282553.79999995},{"$f":"G115+G143+G295+G303+G312+G354+G360+G367+G370+G373","v":717438368.82999992}]
[null,null,"C)  Proventi e oneri finanziari"]
[null,"CA0010","C.1) Interessi attivi","S","CA0010",{"$f":"SUM(F397:F399)","v":0},{"$f":"SUM(G397:G399)","v":1395.3}]
[null,"CA0020","C.1.A) Interessi attivi su c/tesoreria unica",null,"CA0020",{"$f":"SUMIF('00 Aggregatore'!$B:$B,'00 CE'!$E397,'00 Aggregatore'!E:E)","v":0},{"$f":"SUMIF('00 Aggregatore'!$B:$B,'00 CE'!$E397,'00 Aggregatore'!F:F)","v":0}]
[null,"CA0030","C.1.B) Interessi attivi su c/c postali e bancari",null,"CA0030",{"$f":"SUMIF('00 Aggregatore'!$B:$B,'00 CE'!$E398,'00 Aggregatore'!E:E)","v":0},{"$f":"SUMIF('00 Aggregatore'!$B:$B,'00 CE'!$E398,'00 Aggregatore'!F:F)","v":1395.3}]
[null,"CA0040","C.1.C) Altri interessi attivi",null,"CA0040",{"$f":"SUMIF('00 Aggregatore'!$B:$B,'00 CE'!$E399,'00 Aggregatore'!E:E)","v":0},{"$f":"SUMIF('00 Aggregatore'!$B:$B,'00 CE'!$E399,'00 Aggregatore'!F:F)","v":0}]
[null,"CA0050","C.2) Altri proventi","S","CA0050",{"$f":"SUM(F401:F405)","v":0},{"$f":"SUM(G401:G405)","v":0}]
[null,"CA0060","C.2.A) Proventi da partecipazioni",null,"CA0060",{"$f":"SUMIF('00 Aggregatore'!$B:$B,'00 CE'!$E401,'00 Aggregatore'!E:E)","v":0},{"$f":"SUMIF('00 Aggregatore'!$B:$B,'00 CE'!$E401,'00 Aggregatore'!F:F)","v":0}]
[null,"CA0070","C.2.B) Proventi finanziari da crediti iscritti nelle immobilizzazioni",null,"CA0070",{"$f":"SUMIF('00 Aggregatore'!$B:$B,'00 CE'!$E402,'00 Aggregatore'!E:E)","v":0},{"$f":"SUMIF('00 Aggregatore'!$B:$B,'00 CE'!$E402,'00 Aggregatore'!F:F)","v":0}]
[null,"CA0080","C.2.C) Proventi finanziari da titoli iscritti nelle immobilizzazioni",null,"CA0080",{"$f":"SUMIF('00 Aggregatore'!$B:$B,'00 CE'!$E403,'00 Aggregatore'!E:E)","v":0},{"$f":"SUMIF('00 Aggregatore'!$B:$B,'00 CE'!$E403,'00 Aggregatore'!F:F)","v":0}]
[null,"CA0090","C.2.D) Altri proventi finanziari diversi dai precedenti",null,"CA0090",{"$f":"SUMIF('00 Aggregatore'!$B:$B,'00 CE'!$E404,'00 Aggregatore'!E:E)","v":0},{"$f":"SUMIF('00 Aggregatore'!$B:$B,'00 CE'!$E404,'00 Aggregatore'!F:F)","v":0}]
[null,"CA0100","C.2.E) Utili su cambi",null,"CA0100",{"$f":"SUMIF('00 Aggregatore'!$B:$B,'00 CE'!$E405,'00 Aggregatore'!E:E)","v":0},{"$f":"SUMIF('00 Aggregatore'!$B:$B,'00 CE'!$E405,'00 Aggregatore'!F:F)","v":0}]
[null,"CA0110","C.3)  Interessi passivi","S","CA0110",{"$f":"SUM(F407:F409)","v":157826.75},{"$f":"SUM(G407:G409)","v":1449403.09}]
[null,"CA0120","C.3.A) Interessi passivi su anticipazioni di cassa",null,"CA0120",{"$f":"SUMIF('00 Aggregatore'!$B:$B,'00 CE'!$E407,'00 Aggregatore'!E:E)","v":0},{"$f":"SUMIF('00 Aggregatore'!$B:$B,'00 CE'!$E407,'00 Aggregatore'!F:F)","v":0}]
[null,"CA0130","C.3.B) Interessi passivi su mutui",null,"CA0130",{"$f":"SUMIF('00 Aggregatore'!$B:$B,'00 CE'!$E408,'00 Aggregatore'!E:E)","v":0},{"$f":"SUMIF('00 Aggregatore'!$B:$B,'00 CE'!$E408,'00 Aggregatore'!F:F)","v":0}]
[null,"CA0140","C.3.C) Altri interessi passivi",null,"CA0140",{"$f":"SUMIF('00 Aggregatore'!$B:$B,'00 CE'!$E409,'00 Aggregatore'!E:E)","v":157826.75},{"$f":"SUMIF('00 Aggregatore'!$B:$B,'00 CE'!$E409,'00 Aggregatore'!F:F)","v":1449403.09}]
[null,"CA0150","C.4) Altri oneri","S","CA0150",{"$f":"SUM(F411:F412)","v":4522.33},{"$f":"SUM(G411:G412)","v":1932.36}]
[null,"CA0160","C.4.A) Altri oneri finanziari",null,"CA0160",{"$f":"SUMIF('00 Aggregatore'!$B:$B,'00 CE'!$E411,'00 Aggregatore'!E:E)","v":4522.33},{"$f":"SUMIF('00 Aggregatore'!$B:$B,'00 CE'!$E411,'00 Aggregatore'!F:F)","v":1932.36}]
[null,"CA0170","C.4.B) Perdite su cambi",null,"CA0170",{"$f":"SUMIF('00 Aggregatore'!$B:$B,'00 CE'!$E412,'00 Aggregatore'!E:E)","v":0},{"$f":"SUMIF('00 Aggregatore'!$B:$B,'00 CE'!$E412,'00 Aggregatore'!F:F)","v":0}]
[null,"CZ9999","Totale proventi e oneri finanziari (C)","S","CZ9999",{"$f":"F396+F400-F406-F410","v":-162349.07999999999},{"$f":"G396+G400-G406-G410","v":-1449940.1500000001}]
[null,null,"D)  Rettifiche di valore di attività finanziarie"]
[null,"DA0010","D.1)  Rivalutazioni",null,"DA0010",{"$f":"SUMIF('00 Aggregatore'!$B:$B,'00 CE'!$E415,'00 Aggregatore'!E:E)","v":0},{"$f":"SUMIF('00 Aggregatore'!$B:$B,'00 CE'!$E415,'00 Aggregatore'!F:F)","v":0}]
[null,"DA0020","D.2)  Svalutazioni",null,"DA0020",{"$f":"SUMIF('00 Aggregatore'!$B:$B,'00 CE'!$E416,'00 Aggregatore'!E:E)","v":0},{"$f":"SUMIF('00 Aggregatore'!$B:$B,'00 CE'!$E416,'00 Aggregatore'!F:F)","v":0}]
[null,"DZ9999","Totale rettifiche di valore di attività finanziarie (D)","S","DZ9999",{"$f":"+F415-F416","v":0},{"$f":"+G415-G416","v":0}]
[null,null,"E)  Proventi e oneri straordinari"]
[null,"EA0010","E.1) Proventi straordinari","S","EA0010",{"$f":"F420+F421","v":9487148.8499999996},{"$f":"G420+G421","v":12710827.610000001}]
[null,"EA0020","E.1.A) Plusvalenze",null,"EA0020",{"$f":"SUMIF('00 Aggregatore'!$B:$B,'00 CE'!$E420,'00 Aggregatore'!E:E)","v":0},{"$f":"SUMIF('00 Aggregatore'!$B:$B,'00 CE'!$E420,'00 Aggregatore'!F:F)","v":0}]
[null,"EA0030","E.1.B) Altri proventi straordinari","S","EA0030",{"$f":"F422+F423+F433+F443","v":9487148.8499999996},{"$f":"G422+G423+G433+G443","v":12710827.610000001}]
[null,"EA0040","E.1.B.1) Proventi da donazioni e liberalità diverse",null,"EA0040",{"$f":"SUMIF('00 Aggregatore'!$B:$B,'00 CE'!$E422,'00 Aggregatore'!E:E)","v":0},{"$f":"SUMIF('00 Aggregatore'!$B:$B,'00 CE'!$E422,'00 Aggregatore'!F:F)","v":0}]
[null,"EA0050","E.1.B.2) Sopravvenienze attive","S","EA0050",{"$f":"F424+F425","v":7401259.6999999993},{"$f":"G424+G425","v":7539888.9500000011}]
[null,"EA0060","E.1.B.2.1) Sopravvenienze attive v/Aziende sanitarie pubbliche della Regione ",null,"EA0060",{"$f":"SUMIF('00 Aggregatore'!$B:$B,'00 CE'!$E424,'00 Aggregatore'!E:E)","v":2049452.26},{"$f":"SUMIF('00 Aggregatore'!$B:$B,'00 CE'!$E424,'00 Aggregatore'!F:F)","v":3054055.48}]
[null,"EA0070","E.1.B.2.2) Sopravvenienze attive v/terzi","S","EA0070",{"$f":"SUM(F426:F432)","v":5351807.4399999995},{"$f":"SUM(G426:G432)","v":4485833.4700000007}]
[null,"EA0080","E.1.B.2.2.A) Sopravvenienze attive v/terzi relative alla mobilità extraregionale",null,"EA0080",{"$f":"SUMIF('00 Aggregatore'!$B:$B,'00 CE'!$E426,'00 Aggregatore'!E:E)","v":0},{"$f":"SUMIF('00 Aggregatore'!$B:$B,'00 CE'!$E426,'00 Aggregatore'!F:F)","v":0}]
[null,"EA0090","E.1.B.2.2.B) Sopravvenienze attive v/terzi relative al personale",null,"EA0090",{"$f":"SUMIF('00 Aggregatore'!$B:$B,'00 CE'!$E427,'00 Aggregatore'!E:E)","v":0},{"$f":"SUMIF('00 Aggregatore'!$B:$B,'00 CE'!$E427,'00 Aggregatore'!F:F)","v":0}]
[null,"EA0100","E.1.B.2.2.C) Sopravvenienze attive v/terzi relative alle convenzioni con medici di base",null,"EA0100",{"$f":"SUMIF('00 Aggregatore'!$B:$B,'00 CE'!$E428,'00 Aggregatore'!E:E)","v":0},{"$f":"SUMIF('00 Aggregatore'!$B:$B,'00 CE'!$E428,'00 Aggregatore'!F:F)","v":0}]
[null,"EA0110","E.1.B.2.2.D) Sopravvenienze attive v/terzi relative alle convenzioni per la specialistica",null,"EA0110",{"$f":"SUMIF('00 Aggregatore'!$B:$B,'00 CE'!$E429,'00 Aggregatore'!E:E)","v":0},{"$f":"SUMIF('00 Aggregatore'!$B:$B,'00 CE'!$E429,'00 Aggregatore'!F:F)","v":0}]
[null,"EA0120","E.1.B.2.2.E) Sopravvenienze attive v/terzi relative all'acquisto prestaz. sanitarie da operatori accreditati",null,"EA0120",{"$f":"SUMIF('00 Aggregatore'!$B:$B,'00 CE'!$E430,'00 Aggregatore'!E:E)","v":2999852.73},{"$f":"SUMIF('00 Aggregatore'!$B:$B,'00 CE'!$E430,'00 Aggregatore'!F:F)","v":2636094.7400000002}]
[null,"EA0130","E.1.B.2.2.F) Sopravvenienze attive v/terzi relative all'acquisto di beni e servizi",null,"EA0130",{"$f":"SUMIF('00 Aggregatore'!$B:$B,'00 CE'!$E431,'00 Aggregatore'!E:E)","v":341295.78},{"$f":"SUMIF('00 Aggregatore'!$B:$B,'00 CE'!$E431,'00 Aggregatore'!F:F)","v":468853.64}]
[null,"EA0140","E.1.B.2.2.G) Altre sopravvenienze attive v/terzi",null,"EA0140",{"$f":"SUMIF('00 Aggregatore'!$B:$B,'00 CE'!$E432,'00 Aggregatore'!E:E)","v":2010658.93},{"$f":"SUMIF('00 Aggregatore'!$B:$B,'00 CE'!$E432,'00 Aggregatore'!F:F)","v":1380885.09}]
[null,"EA0150","E.1.B.3) Insussistenze attive ","S","EA0150",{"$f":"SUM(F434:F435)","v":2085889.15},{"$f":"SUM(G434:G435)","v":5170938.66}]
[null,"EA0160","E.1.B.3.1) Insussistenze attive v/Aziende sanitarie pubbliche della Regione",null,"EA0160",{"$f":"SUMIF('00 Aggregatore'!$B:$B,'00 CE'!$E434,'00 Aggregatore'!E:E)","v":0},{"$f":"SUMIF('00 Aggregatore'!$B:$B,'00 CE'!$E434,'00 Aggregatore'!F:F)","v":0}]
[null,"EA0170","E.1.B.3.2) Insussistenze attive v/terzi","S","EA0170",{"$f":"SUM(F436:F442)","v":2085889.15},{"$f":"SUM(G436:G442)","v":5170938.66}]
[null,"EA0180","E.1.B.3.2.A) Insussistenze attive v/terzi relative alla mobilità extraregionale",null,"EA0180",{"$f":"SUMIF('00 Aggregatore'!$B:$B,'00 CE'!$E436,'00 Aggregatore'!E:E)","v":0},{"$f":"SUMIF('00 Aggregatore'!$B:$B,'00 CE'!$E436,'00 Aggregatore'!F:F)","v":0}]
[null,"EA0190","E.1.B.3.2.B) Insussistenze attive v/terzi relative al personale",null,"EA0190",{"$f":"SUMIF('00 Aggregatore'!$B:$B,'00 CE'!$E437,'00 Aggregatore'!E:E)","v":0},{"$f":"SUMIF('00 Aggregatore'!$B:$B,'00 CE'!$E437,'00 Aggregatore'!F:F)","v":0}]
[null,"EA0200","E.1.B.3.2.C) Insussistenze attive v/terzi relative alle convenzioni con medici di base",null,"EA0200",{"$f":"SUMIF('00 Aggregatore'!$B:$B,'00 CE'!$E438,'00 Aggregatore'!E:E)","v":0},{"$f":"SUMIF('00 Aggregatore'!$B:$B,'00 CE'!$E438,'00 Aggregatore'!F:F)","v":0}]
[null,"EA0210","E.1.B.3.2.D) Insussistenze attive v/terzi relative alle convenzioni per la specialistica",null,"EA0210",{"$f":"SUMIF('00 Aggregatore'!$B:$B,'00 CE'!$E439,'00 Aggregatore'!E:E)","v":0},{"$f":"SUMIF('00 Aggregatore'!$B:$B,'00 CE'!$E439,'00 Aggregatore'!F:F)","v":0}]
[null,"EA0220","E.1.B.3.2.E) Insussistenze attive v/terzi relative all'acquisto prestaz. sanitarie da operatori accreditati",null,"EA0220",{"$f":"SUMIF('00 Aggregatore'!$B:$B,'00 CE'!$E440,'00 Aggregatore'!E:E)","v":1672403.91},{"$f":"SUMIF('00 Aggregatore'!$B:$B,'00 CE'!$E440,'00 Aggregatore'!F:F)","v":326389.61}]
[null,"EA0230","E.1.B.3.2.F) Insussistenze attive v/terzi relative all'acquisto di beni e servizi",null,"EA0230",{"$f":"SUMIF('00 Aggregatore'!$B:$B,'00 CE'!$E441,'00 Aggregatore'!E:E)","v":288245.17},{"$f":"SUMIF('00 Aggregatore'!$B:$B,'00 CE'!$E441,'00 Aggregatore'!F:F)","v":4775754.84}]
[null,"EA0240","E.1.B.3.2.G) Altre insussistenze attive v/terzi",null,"EA0240",{"$f":"SUMIF('00 Aggregatore'!$B:$B,'00 CE'!$E442,'00 Aggregatore'!E:E)","v":125240.07},{"$f":"SUMIF('00 Aggregatore'!$B:$B,'00 CE'!$E442,'00 Aggregatore'!F:F)","v":68794.210000000006}]
[null,"EA0250","E.1.B.4) Altri proventi straordinari",null,"EA0250",{"$f":"SUMIF('00 Aggregatore'!$B:$B,'00 CE'!$E443,'00 Aggregatore'!E:E)","v":0},{"$f":"SUMIF('00 Aggregatore'!$B:$B,'00 CE'!$E443,'00 Aggregatore'!F:F)","v":0}]
[null,"EA0260","E.2) Oneri straordinari","S","EA0260",{"$f":"F445+F446","v":4569599.68},{"$f":"G445+G446","v":7435248.2199999997}]
[null,"EA0270","E.2.A) Minusvalenze",null,"EA0270",{"$f":"SUMIF('00 Aggregatore'!$B:$B,'00 CE'!$E445,'00 Aggregatore'!E:E)","v":0},{"$f":"SUMIF('00 Aggregatore'!$B:$B,'00 CE'!$E445,'00 Aggregatore'!F:F)","v":19530.05}]
[null,"EA0280","E.2.B) Altri oneri straordinari","S","EA0280",{"$f":"F447+F448+F449+F464+F474","v":4569599.68},{"$f":"G447+G448+G449+G464+G474","v":7415718.1699999999}]
[null,"EA0290","E.2.B.1) Oneri tributari da esercizi precedenti",null,"EA0290",{"$f":"SUMIF('00 Aggregatore'!$B:$B,'00 CE'!$E447,'00 Aggregatore'!E:E)","v":0},{"$f":"SUMIF('00 Aggregatore'!$B:$B,'00 CE'!$E447,'00 Aggregatore'!F:F)","v":0}]
[null,"EA0300","E.2.B.2) Oneri da cause civili ed oneri processuali",null,"EA0300",{"$f":"SUMIF('00 Aggregatore'!$B:$B,'00 CE'!$E448,'00 Aggregatore'!E:E)","v":0},{"$f":"SUMIF('00 Aggregatore'!$B:$B,'00 CE'!$E448,'00 Aggregatore'!F:F)","v":0}]
[null,"EA0310","E.2.B.3) Sopravvenienze passive","S","EA0310",{"$f":"F450+F453","v":3545337.7199999997},{"$f":"G450+G453","v":6303302.5099999998}]
[null,"EA0320","E.2.B.3.1) Sopravvenienze passive v/Aziende sanitarie pubbliche della Regione","S","EA0320",{"$f":"SUM(F451:F452)","v":134078.51},{"$f":"SUM(G451:G452)","v":122869.51}]
[null,"EA0330","E.2.B.3.1.A) Sopravvenienze passive v/Aziende sanitarie pubbliche relative alla mobilità intraregionale",null,"EA0330",{"$f":"SUMIF('00 Aggregatore'!$B:$B,'00 CE'!$E451,'00 Aggregatore'!E:E)","v":0},{"$f":"SUMIF('00 Aggregatore'!$B:$B,'00 CE'!$E451,'00 Aggregatore'!F:F)","v":0}]
[null,"EA0340","E.2.B.3.1.B) Altre sopravvenienze passive v/Aziende sanitarie pubbliche della Regione",null,"EA0340",{"$f":"SUMIF('00 Aggregatore'!$B:$B,'00 CE'!$E452,'00 Aggregatore'!E:E)","v":134078.51},{"$f":"SUMIF('00 Aggregatore'!$B:$B,'00 CE'!$E452,'00 Aggregatore'!F:F)","v":122869.51}]
[null,"EA0350","E.2.B.3.2) Sopravvenienze passive v/terzi","S","EA0350",{"$f":"F454+F455+SUM(F459:F463)","v":3411259.21},{"$f":"G454+G455+SUM(G459:G463)","v":6180433}]
[null,"EA0360","E.2.B.3.2.A) Sopravvenienze passive v/terzi relative alla mobilità extraregionale",null,"EA0360",{"$f":"SUMIF('00 Aggregatore'!$B:$B,'00 CE'!$E454,'00 Aggregatore'!E:E)","v":0},{"$f":"SUMIF('00 Aggregatore'!$B:$B,'00 CE'!$E454,'00 Aggregatore'!F:F)","v":0}]
[null,"EA0370","E.2.B.3.2.B) Sopravvenienze passive v/terzi relative al personale","S","EA0370",{"$f":"SUM(F456:F458)","v":551740.16999999993},{"$f":"SUM(G456:G458)","v":2601517.9900000002}]
[null,"EA0380","E.2.B.3.2.B.1) Soprav. passive v/terzi relative al personale - dirigenza medica",null,"EA0380",{"$f":"SUMIF('00 Aggregatore'!$B:$B,'00 CE'!$E456,'00 Aggregatore'!E:E)","v":183240.74},{"$f":"SUMIF('00 Aggregatore'!$B:$B,'00 CE'!$E456,'00 Aggregatore'!F:F)","v":3919.87}]
[null,"EA0390","E.2.B.3.2.B.2) Soprav. passive v/terzi relative al personale - dirigenza non medica",null,"EA0390",{"$f":"SUMIF('00 Aggregatore'!$B:$B,'00 CE'!$E457,'00 Aggregatore'!E:E)","v":5333.38},{"$f":"SUMIF('00 Aggregatore'!$B:$B,'00 CE'!$E457,'00 Aggregatore'!F:F)","v":7520.5}]
[null,"EA0400","E.2.B.3.2.B.3) Soprav. passive v/terzi relative al personale - comparto",null,"EA0400",{"$f":"SUMIF('00 Aggregatore'!$B:$B,'00 CE'!$E458,'00 Aggregatore'!E:E)","v":363166.05},{"$f":"SUMIF('00 Aggregatore'!$B:$B,'00 CE'!$E458,'00 Aggregatore'!F:F)","v":2590077.62}]
[null,"EA0410","E.2.B.3.2.C) Sopravvenienze passive v/terzi relative alle convenzioni con medici di base",null,"EA0410",{"$f":"SUMIF('00 Aggregatore'!$B:$B,'00 CE'!$E459,'00 Aggregatore'!E:E)","v":0},{"$f":"SUMIF('00 Aggregatore'!$B:$B,'00 CE'!$E459,'00 Aggregatore'!F:F)","v":2272.9499999999998}]
[null,"EA0420","E.2.B.3.2.D) Sopravvenienze passive v/terzi relative alle convenzioni per la specialistica",null,"EA0420",{"$f":"SUMIF('00 Aggregatore'!$B:$B,'00 CE'!$E460,'00 Aggregatore'!E:E)","v":48576.12},{"$f":"SUMIF('00 Aggregatore'!$B:$B,'00 CE'!$E460,'00 Aggregatore'!F:F)","v":53207.86}]
[null,"EA0430","E.2.B.3.2.E) Sopravvenienze passive v/terzi relative all'acquisto prestaz. sanitarie da operatori accreditati",null,"EA0430",{"$f":"SUMIF('00 Aggregatore'!$B:$B,'00 CE'!$E461,'00 Aggregatore'!E:E)","v":25282.29},{"$f":"SUMIF('00 Aggregatore'!$B:$B,'00 CE'!$E461,'00 Aggregatore'!F:F)","v":965342.11}]
[null,"EA0440","E.2.B.3.2.F) Sopravvenienze passive v/terzi relative all'acquisto di beni e servizi",null,"EA0440",{"$f":"SUMIF('00 Aggregatore'!$B:$B,'00 CE'!$E462,'00 Aggregatore'!E:E)","v":2651265.85},{"$f":"SUMIF('00 Aggregatore'!$B:$B,'00 CE'!$E462,'00 Aggregatore'!F:F)","v":2001061.54}]
[null,"EA0450","E.2.B.3.2.G) Altre sopravvenienze passive v/terzi",null,"EA0450",{"$f":"SUMIF('00 Aggregatore'!$B:$B,'00 CE'!$E463,'00 Aggregatore'!E:E)","v":134394.78},{"$f":"SUMIF('00 Aggregatore'!$B:$B,'00 CE'!$E463,'00 Aggregatore'!F:F)","v":557030.55000000005}]
[null,"EA0460","E.2.B.4) Insussistenze passive","S","EA0460",{"$f":"SUM(F465:F466)","v":1024261.96},{"$f":"SUM(G465:G466)","v":1112415.6600000001}]
[null,"EA0470","E.2.B.4.1) Insussistenze passive v/Aziende sanitarie pubbliche della Regione",null,"EA0470",{"$f":"SUMIF('00 Aggregatore'!$B:$B,'00 CE'!$E465,'00 Aggregatore'!E:E)","v":0},{"$f":"SUMIF('00 Aggregatore'!$B:$B,'00 CE'!$E465,'00 Aggregatore'!F:F)","v":0}]
[null,"EA0480","E.2.B.4.2) Insussistenze passive v/terzi","S","EA0480",{"$f":"SUM(F467:F473)","v":1024261.96},{"$f":"SUM(G467:G473)","v":1112415.6600000001}]
[null,"EA0490","E.2.B.4.2.A) Insussistenze passive v/terzi relative alla mobilità extraregionale",null,"EA0490",{"$f":"SUMIF('00 Aggregatore'!$B:$B,'00 CE'!$E467,'00 Aggregatore'!E:E)","v":0},{"$f":"SUMIF('00 Aggregatore'!$B:$B,'00 CE'!$E467,'00 Aggregatore'!F:F)","v":0}]
[null,"EA0500","E.2.B.4.2.B) Insussistenze passive v/terzi relative al personale",null,"EA0500",{"$f":"SUMIF('00 Aggregatore'!$B:$B,'00 CE'!$E468,'00 Aggregatore'!E:E)","v":0},{"$f":"SUMIF('00 Aggregatore'!$B:$B,'00 CE'!$E468,'00 Aggregatore'!F:F)","v":0}]
[null,"EA0510","E.2.B.4.2.C) Insussistenze passive v/terzi relative alle convenzioni con medici di base",null,"EA0510",{"$f":"SUMIF('00 Aggregatore'!$B:$B,'00 CE'!$E469,'00 Aggregatore'!E:E)","v":0},{"$f":"SUMIF('00 Aggregatore'!$B:$B,'00 CE'!$E469,'00 Aggregatore'!F:F)","v":0}]
[null,"EA0520","E.2.B.4.2.D) Insussistenze passive v/terzi relative alle convenzioni per la specialistica",null,"EA0520",{"$f":"SUMIF('00 Aggregatore'!$B:$B,'00 CE'!$E470,'00 Aggregatore'!E:E)","v":0},{"$f":"SUMIF('00 Aggregatore'!$B:$B,'00 CE'!$E470,'00 Aggregatore'!F:F)","v":0}]
[null,"EA0530","E.2.B.4.2.E) Insussistenze passive v/terzi relative all'acquisto prestaz. sanitarie da operatori accreditati",null,"EA0530",{"$f":"SUMIF('00 Aggregatore'!$B:$B,'00 CE'!$E471,'00 Aggregatore'!E:E)","v":832320.62},{"$f":"SUMIF('00 Aggregatore'!$B:$B,'00 CE'!$E471,'00 Aggregatore'!F:F)","v":907726.79}]
[null,"EA0540","E.2.B.4.2.F) Insussistenze passive v/terzi relative all'acquisto di beni e servizi",null,"EA0540",{"$f":"SUMIF('00 Aggregatore'!$B:$B,'00 CE'!$E472,'00 Aggregatore'!E:E)","v":115363.27},{"$f":"SUMIF('00 Aggregatore'!$B:$B,'00 CE'!$E472,'00 Aggregatore'!F:F)","v":33658.5}]
[null,"EA0550","E.2.B.4.2.G) Altre insussistenze passive v/terzi",null,"EA0550",{"$f":"SUMIF('00 Aggregatore'!$B:$B,'00 CE'!$E473,'00 Aggregatore'!E:E)","v":76578.070000000007},{"$f":"SUMIF('00 Aggregatore'!$B:$B,'00 CE'!$E473,'00 Aggregatore'!F:F)","v":171030.37}]
[null,"EA0560","E.2.B.5) Altri oneri straordinari",null,"EA0560",{"$f":"SUMIF('00 Aggregatore'!$B:$B,'00 CE'!$E474,'00 Aggregatore'!E:E)","v":0},{"$f":"SUMIF('00 Aggregatore'!$B:$B,'00 CE'!$E474,'00 Aggregatore'!F:F)","v":0}]
[null,"EZ9999","Totale proventi e oneri straordinari (E)","S","EZ9999",{"$f":"F419-F444","v":4917549.17},{"$f":"G419-G444","v":5275579.3900000015}]
[null,"XA0000","Risultato prima delle imposte (A - B +/- C +/- D +/- E)","s","XA0000",{"$f":"F113-F394+F413+F417+F475","v":-1463013.2999998666},{"$f":"G113-G394+G413+G417+G475","v":12515877.140000336}]
[null,null,"Imposte e tasse "]
[null,"YA0010","Y.1) IRAP","S","YA0010",{"$f":"SUM(F479:F482)","v":11656544.959999999},{"$f":"SUM(G479:G482)","v":12105925.799999999}]
[null,"YA0020","Y.1.A) IRAP relativa a personale dipendente",null,"YA0020",{"$f":"SUMIF('00 Aggregatore'!$B:$B,'00 CE'!$E479,'00 Aggregatore'!E:E)","v":10634384.52},{"$f":"SUMIF('00 Aggregatore'!$B:$B,'00 CE'!$E479,'00 Aggregatore'!F:F)","v":11109282.459999999}]
[null,"YA0030","Y.1.B) IRAP relativa a collaboratori e personale assimilato a lavoro dipendente",null,"YA0030",{"$f":"SUMIF('00 Aggregatore'!$B:$B,'00 CE'!$E480,'00 Aggregatore'!E:E)","v":470809.27999999997},{"$f":"SUMIF('00 Aggregatore'!$B:$B,'00 CE'!$E480,'00 Aggregatore'!F:F)","v":577892.56999999995}]
[null,"YA0040","Y.1.C) IRAP relativa ad attività di libera professione (intramoenia)",null,"YA0040",{"$f":"SUMIF('00 Aggregatore'!$B:$B,'00 CE'!$E481,'00 Aggregatore'!E:E)","v":458072.41000000003},{"$f":"SUMIF('00 Aggregatore'!$B:$B,'00 CE'!$E481,'00 Aggregatore'!F:F)","v":418750.77}]
[null,"YA0050","Y.1.D) IRAP relativa ad attività commerciale",null,"YA0050",{"$f":"SUMIF('00 Aggregatore'!$B:$B,'00 CE'!$E482,'00 Aggregatore'!E:E)","v":93278.75},{"$f":"SUMIF('00 Aggregatore'!$B:$B,'00 CE'!$E482,'00 Aggregatore'!F:F)","v":0}]
[null,"YA0060","Y.2) IRES","S","YA0060",{"$f":"SUM(F484:F485)","v":490066},{"$f":"SUM(G484:G485)","v":408274}]
[null,"YA0070","Y.2.A) IRES su attività istituzionale",null,"YA0070",{"$f":"SUMIF('00 Aggregatore'!$B:$B,'00 CE'!$E484,'00 Aggregatore'!E:E)","v":0},{"$f":"SUMIF('00 Aggregatore'!$B:$B,'00 CE'!$E484,'00 Aggregatore'!F:F)","v":0}]
[null,"YA0080","Y.2.B) IRES su attività commerciale",null,"YA0080",{"$f":"SUMIF('00 Aggregatore'!$B:$B,'00 CE'!$E485,'00 Aggregatore'!E:E)","v":490066},{"$f":"SUMIF('00 Aggregatore'!$B:$B,'00 CE'!$E485,'00 Aggregatore'!F:F)","v":408274}]
[null,"YA0090","Y.3) Accantonamento a F.do Imposte (Accertamenti, condoni, ecc.)",null,"YA0090",{"$f":"SUMIF('00 Aggregatore'!$B:$B,'00 CE'!$E486,'00 Aggregatore'!E:E)","v":0},{"$f":"SUMIF('00 Aggregatore'!$B:$B,'00 CE'!$E486,'00 Aggregatore'!F:F)","v":0}]
[null,"YZ9999","Totale imposte e tasse","S","YZ9999",{"$f":"F478+F483+F486","v":12146610.959999999},{"$f":"G478+G483+G486","v":12514199.799999999}]
[null,"ZZ9999","RISULTATO DI ESERCIZIO","S","ZZ9999",{"$f":"F476-F487","v":-13609624.259999866},{"$f":"G476-G487","v":1677.3400003369898}]

{"sheet":"Tab 50-51","index":3,"n_rows":67,"n_cols":11,"rows_kept":67,"cut":false,"hidden":false,"merged":[[29,10,35,10],[14,0,18,0],[14,1,18,1],[13,2,13,4],[13,6,13,7],[31,6,31,7],[24,6,24,7],[25,6,25,7],[29,6,29,7],[20,2,20,4],[21,2,21,4],[21,6,21,7],[20,6,20,7],[22,6,22,7],[22,2,22,4],[24,2,24,4],[25,2,25,4],[31,2,31,4],[27,2,27,4],[28,2,28,4],[29,2,29,4],[30,2,30,4],[30,6,30,7],[27,6,27,7],[28,6,28,7],[23,2,23,4],[23,6,23,7],[19,2,19,4],[19,6,19,7],[17,10,18,10],[14,2,18,4],[14,6,18,7],[14,8,18,8],[14,10,16,10],[14,5,18,5],[20,10,25,10],[14,9,18,9],[0,0,0,10],[2,1,2,10],[3,0,4,0],[3,1,4,1],[3,2,4,2],[3,3,4,3],[3,4,4,4],[3,5,4,10],[10,6,12,7],[10,9,12,9],[10,10,12,10],[10,0,12,0],[10,1,12,1],[10,5,12,5],[10,8,12,8],[10,2,12,4],[5,5,5,10],[6,5,6,10],[7,5,7,10],[39,6,39,7],[39,2,39,4],[38,2,38,4],[35,2,35,4],[36,2,36,4],[37,2,37,4],[45,6,45,7],[45,2,45,4],[47,6,47,7],[43,2,43,4],[44,2,44,4],[46,2,46,4],[56,2,56,4],[57,2,57,4],[53,2,53,4],[54,2,54,4],[55,2,55,4],[59,2,59,4],[26,6,26,7],[33,6,33,7],[34,2,34,4],[34,6,34,7],[42,2,42,4],[41,2,41,4],[42,6,42,7],[40,6,40,7],[40,2,40,4],[32,6,32,7],[32,2,32,4],[33,2,33,4],[26,2,26,4],[41,6,41,7],[35,6,35,7],[36,6,36,7],[37,6,37,7],[38,6,38,7],[52,6,52,7],[43,6,43,7],[44,6,44,7],[46,6,46,7],[50,6,50,7],[51,6,51,7],[50,2,50,4],[51,2,51,4],[48,2,48,4],[48,6,48,7],[66,0,66,7],[46,10,49,10],[62,2,62,4],[62,6,62,7],[63,2,63,4],[63,6,63,7],[64,2,64,4],[64,6,64,7],[60,2,60,4],[60,6,60,7],[61,2,61,4],[61,6,61,7],[55,6,55,7],[54,6,54,7],[53,6,53,7],[49,6,49,7],[49,2,49,4],[47,2,47,4],[58,2,58,4],[52,2,52,4],[58,6,58,7],[59,6,59,7],[57,6,57,7],[56,6,56,7]]}
["17.     Contributi in conto esercizio"]
[]
[null,"Tab. 50 – Dettagli contributi in conto esercizio"]
["CODICE MOD. CE","CONTRIBUTI IN C/ESERCIZIO","Quota Capitaria","Funzioni","Altro","Note"]
[]
["AA0030","Contributi da Regione o Prov. Aut. per quota F.S. regionale indistinto",544141166.15999997,11338597.85,0]
["AA0080","Contributi da Regione o Prov. Aut. (extra fondo) - Risorse aggiuntive da bilancio regionale a titolo di copertura LEA",0,0,0]
["AA0090","Contributi da Regione o Prov. Aut. (extra fondo) - Risorse aggiuntive da bilancio regionale a titolo di copertura extra LEA",0,0,0]
[]
[null,"Tab. 51 – Informativa contributi in conto esercizio"]
["CODICE MOD. CE","DETTAGLIO CONTRIBUTI IN C/ESERCIZIO","Atto",null,null,"Data","Oggetto",null,"Importo assegnato","Importo utilizzato","Codice\nconto"]
[]
[]
["AA0020","DA REGIONE O P.A. PER QUOTA F.S. REGIONALE:",null,null,null,null,null,null,{"$f":"I15+I20","v":569244565.85000002}]
["AA0030","Quota F.S. regionale - indistinto","Delibera di Giunta Regionale n. 376 del 01/07/2019 - Nota prot. n.RA/0122860/DPF012  del 19 aprile 2019 \"Linee guida alla redazione del bilancio d'esercizio al 31/12/2018\"",null,null,"2019-04-19","Riparto delle disponibilità finanaziarie per il SSR anno 2018 a favore delle ASL e della GSA presso la Regione",null,{"$f":"544141166.16+11338597.85","v":555479764.00999999},null,"03.01.01.01.01"]
[]
[]
[null,null,null,null,null,null,null,null,null,null,"03.01.01.01.02"]
[]
["AA0040","Quota F.S. regionale - vincolato:",null,null,null,null,null,null,{"$f":"SUM(I21:I27)","v":13764801.84}]
[null,"Rimborso farmaci innovativi 2018 - Obiettivi PSN","Determina DPF003/205 del 28/12/2018, liquidata con DPF003/16 del 13/02/2019 (importo rettificato con nota prot. n. RA/93211/19 DPF003 del 26/03/2019)",null,null,"2019-02-13","Legge 23 dicembre 1996, n. 662, c. 34 e 34-bis, art. 1 \"Misure di razionalizzazione della finanza pubblica\". Erogazione alle AASSLL della somma trasferita quale rimborso alle Regioni per l'acquisto dei farmaci innovativi - Anno 2018",null,3183837.63,null,"03.01.01.02.12"]
[null,"Rimborso farmaci innovativi oncologici 2018 - Obiettivi PSN","Determina DPF003/204 del 28/12/2018, liquidata con DPF003/17 del 13/02/2019 (importo rettificato con nota prot. n. RA/93232/19 DPF003 del 26/03/2019)",null,null,"2019-02-13","Legge 23 dicembre 1996, n. 662, c. 34 e 34-bis, art. 1 \"Misure di razionalizzazione della finanza pubblica\". Erogazione alle AASSLL della somma trasferita quale rimborso alle Regioni per l'acquisto dei farmaci innovativi oncologici - Anno 2018",null,3350445.08]
[null,"Obiettivi di Piano 2018 art. 11 cc. 34 e 34bis L. 662/96","DPF/19",null,null,"2018-11-27","Obiettivi di Piano 2018",null,4605324.66,0]
[null,"Obiettivi di Piano 2018 art. 11 cc. 34 e 34bis L. 662/96","DPF010/32",null,null,"2018-12-06","Obiettivi di Piano 2018 Prevenzione",null,1848544.63,0]
[null,"Sanità Penitenziaria - Acconto 2018","DPF015/78 del 31/12/2018, assegnata alle ASL con DPF015/19 del 21/03/2019 ",null,null,"2019-03-21","Attività sanitaria nei confronti dei detenuti internati e dei minorenni sottoposti a provvedimento penale ex DPCM 1 aprile 2008",null,725026.74,0]
[null,"Prevenzione e assistenza detenuti tossicodipendenti - Acconto 2018","DPF15/64 del 04/12/2018 e DPF15/74 del 20/12/2018",null,null,"2018-12-20","Finanziamento dello Stato per la prevenzione e l'assistenza dei detenuti tossicodipendenti",null,37833.599999999999,0]
[null,"Emergenza Avicola L.205/2017 art.1 c.509","DPF011/176",null,null,"2018-12-04","Influenza aviaria",null,13789.5,13789.5,"03.01.01.02.15"]
["AA0050","EXTRA FONDO:",null,null,null,null,null,null,{"$f":"I29+I43+I46","v":578939.97}]
["AA0070","Contributi da Regione o Prov. Aut. (extra fondo) vincolati:",null,null,null,null,null,null,{"$f":"SUM(I30:I36)","v":410404.72}]
[null,"Piano di monitoraggio per la ricerca di diossine negli alimenti di origine animale","DPF011/08",null,null,"2018-01-24","Diossine negli alimenti di origine animale",null,4078,4078,"03.01.02.01.01"]
[null,"Finanziamento 2018 Consultori familiari","DPF015/34",null,null,"2018-05-30","Consultori familiari 2018 - DGR n. 289/2018",null,85050.79,85050.79]
[null,"Ricollocamento personale ESACRI presso ASL - II semestre 2017","DPF004/03",null,null,"2018-05-09","Ricollocamento personale ESACRI presso ASL - II semestre 2017",null,153912.94,153912.94]
[null,"Rimborso prestazioni sanitarie a favore di stranieri non in regola di cui all'art. 35, c. 6, D. Lgs. n. 286 del 25/07/1998","DPF015/51",null,null,"2018-10-04","Extracomunitari irregolari D. Lgs. 286/1998 - Acconto FSN 2017",null,127091.97,127091.97]
[null,"Miglioramento servizio informativo veterinario","DPF011/178",null,null,"2018-12-13","D. Lgs. n. 194/2008 - Miglioramento servizio informativo veterinario",null,14143.05,14143.05]
[null,"Protezione soggetti malati di celiachia - Anno 2015","DPF009/72",null,null,"2018-12-05","Protezione soggetti malati di celiachia - L. 123/2015 anno 2015",null,5790.69,5790.69]
[null,"Protezione soggetti malati di celiachia - Anno 2016","DPF009/72",null,null,"2018-12-05","Protezione soggetti malati di celiachia - L. 123/2015 anno 2016",null,20337.28,20337.28]
["AA0080","Contributi da Regione o Prov. Aut. (extra fondo) - \nRisorse aggiuntive da bilancio regionale a titolo di copertura LEA",null,null,null,null,null,null,0]
["AA0090","Contributi da Regione o Prov. Aut. (extra fondo) - \nRisorse aggiuntive da bilancio regionale a titolo di copertura extra LEA",null,null,null,null,null,null,0]
["AA0100","Contributi da Regione o Prov. Aut. (extra fondo) - Altro",null,null,null,null,null,null,0]
["AA0120","Contributi da Aziende sanitarie pubbliche della Regione o Prov. Aut. (extra fondo) vincolati:",null,null,null,null,null,null,0]
[null,"Progetto 1",null,null,null,null,null,null,0]
[null,"Progetto ….",null,null,null,null,null,null,0]
["AA0130","Contributi da Aziende sanitarie pubbliche (extra fondo) altro:",null,null,null,null,null,null,{"$f":"SUM(I44)","v":0}]
[null,"Progetto 1",null,null,null,null,null,null,0]
[null,"Progetto ….",null,null,null,null,null,null,0]
["AA0150","Contributi da altri soggetti pubblici (extra fondo) vincolati:",null,null,null,null,null,null,{"$f":"SUM(I47:I50)","v":168535.25}]
[null,"Potenziamento attività prelievo organi e tessuti - 2015","Provv. nn. 4364-4365 ",null,null,"2018-04-09","Potenziamento attività prelievo organi e tessuti - 2015",null,121430.97,92725.11,"03.01.02.03.06"]
[null,"Contributo modifica strumenti di guida e autoveicoli privati - anno 2017","DPF009/21",null,null,"2018-05-14","Contributo modifica strumenti di guida e autoveicoli privati - anno 2017",null,15472.26,15472.26]
[null,"Contributo in favore portatori grave disabilità psichica e motoria - anno 2017","DPF013/88",null,null,"2018-07-31","Contributo in favore portatori grave disabilità psichica e motoria - anno 2017",null,7232.02,7232.02]
[null,"Fondi per acquisto attrezzature \"Trapianto organi\"","Provv. n. 15351",null,null,"2018-12-05","Fondi per acquisto attrezzature \"Trapianto organi\"",null,24400,0]
["AA0160","Contributi da altri soggetti pubblici (extra fondo) L.210/92:",null,null,null,null,null,null,0]
["AA0170","Contributi da altri soggetti pubblici (extra fondo) altro:",null,null,null,null,null,null,0]
[null,"….",null,null,null,null,null,null,0]
[null,"PER RICERCA:",null,null,null,null,null,null,0]
["AA0190","Contributi da Ministero della Salute per ricerca corrente:",null,null,null,null,null,null,0]
[null,"….",null,null,null,null,null,null,0]
["AA0200","Contributi da Ministero della Salute per ricerca finalizzata:",null,null,null,null,null,null,0]
[null,"Progetto ….",null,null,null,null,null,null,0]
["AA0210","Contributi da Regione ed altri soggetti pubblici per ricerca:",null,null,null,null,null,null,0]
[null,"….",null,null,null,null,null,null,0]
["AA0220","Contributi da privati per ricerca:",null,null,null,null,null,null,0]
[null,"….",null,null,null,null,null,null,0]
["AA0230","CONTRIBUTI DA PRIVATI:",null,null,null,null,null,null,0]
[null,"….",null,null,null,null,null,null,0]
[null,"….",null,null,null,null,null,null,0]
[]
["TOTALE CONTRIBUTI IN C/ESERCIZIO",null,null,null,null,null,null,null,{"$f":"I14+I28","v":569823505.82000005}]

{"sheet":"Dettaglio voce AA0280","index":4,"n_rows":40,"n_cols":5,"rows_kept":40,"cut":false,"hidden":false,"merged":[[35,0,35,2],[1,0,1,3],[25,0,26,0],[25,1,26,1],[39,0,39,2]]}
[]
["Dettaglio somme vincolate anni precedenti rilevate nella voce AA0280"]
[]
[]
[]
["Descrizione somma vincolata","Anno di competenza","Estremi Provvedimento","Importo (in €)"]
["Prevenzione e assistenza detenuti tossicodipendenti - Acconto 2017 - D. Lgs. n. 230/1999",2017,"DPF015/01 del 04/01/2018",37833.599999999999]
["Prevenzione e assistenza detenuti tossicodipendenti - Saldo 2017 - D. Lgs. n. 230/1999",2017,"DPF015/63 del 30/11/2018",9458.4]
["Sanità Penitenziaria Saldo 2015",2015,"DPF015/02 del 09/01/2018",214122.7]
["Sanità Penitenziaria Saldo 2016",2016,"DPF015/03 del 09/01/2018",152386.59]
["Sanità Penitenziaria 2017",2017,"DPF015/66 del 05/12/2018",912430.92]
["Fondo esclusività dirigenti ruolo sanitario L. 488//1998 - Anno 2013",2013,"DPF004/04 del 11/09/2018",191892.75]
["Fondo esclusività dirigenti ruolo sanitario L. 488//1998 - Anno 2014",2014,"DPF004/04 del 11/09/2018",194871.74]
["Fondo esclusività dirigenti ruolo sanitario L. 488//1998 - Anno 2015",2015,"DPF004/04 del 11/09/2018",193877.34]
["Fondo esclusività dirigenti ruolo sanitario L. 488//1998 - Anno 2016",2016,"DPF004/04 del 11/09/2018",193877.34]
["Trattamento domiciliare malati AIDS - FSN 2012 L. 135/1990",2012,"DPF010/07 del 06/02/2018",106866.86]
["Lotta contro AIDS - 24° corso formazione professionale",null,"DPF004/02 del 05/04/2018",56899.99]
["Screening neonatale per la diagnosi precoce di malattie metaboliche ereditarie",null,"DPF010/14 del 28/02/2018",127428.88]
["Finanziamento GAP",2017,"DPF012/13 del 31/01/2017",220805,"a"]
["Emersione lavoratori stranieri irregolari D.Lgs. 109/2012 - anno 2012",2012,"DPF015/44 del 04/09/2018",433204.73]
["Emersione lavoratori stranieri irregolari D.Lgs. 109/2012 - anno 2013",2013,"DPF015/45 del 11/09/2018",184962.39]
["Obiettivi di piano 2009",2009,"DGR n. 246/2009",202540.9,"a"]
["Obiettivi di piano 2010",2010,"DGR N. 655 del 31/08/2010",113685.18,"a"]
["Obiettivi di piano 2011",2011,"DGR n. 412 del 15/06/2011",64462.43,"a"]
["Obiettivi di Piano 2012",2012,"DGR n. 8 del 14/01/2013 ",385326.73,"a"]
["Obiettivi di Piano 2013",2013,"DGR n. 269 del 14/04/2014",2463759.73,"a"]
[null,null,"Piano della prevenzione 2013 - DG20/26 del 20/10/2014",1245771.8,"a"]
["Obiettivi di Piano 2014",2014,"DGR n. 812 del 29/09/2015",1848234.18,"a"]
["Obiettivi di Piano 2015",2015,"DGR n. 178 del 22/03/2016",88638.65,"a"]
["Piano della prevenzione 2013/2014/2016","2013/2014/2016","Piano della prevenzione 2013/2014/2016",362110.43,"a"]
["Obiettivi di Piano 2016",2016,"DGR n. 260/2017",204181.7,"a"]
[null,null,"Imputazione quota utilizzo 2018 progetti obiettivo per acquisto cespiti Piano Prevenzione",-54089.57]
[null,null,"Imputazione quota utilizzo 2018 progetti obiettivo per acquisto ecografi",-674660]
[null,null,"Imputazione quota utilizzo 2018 progetti obiettivo per lavori edili",-644642.53]
[null,null,"Imputazione quota utilizzo 2018 Progetti Obiettivo per acquisto cespiti Piano triennale degli investimenti DG 179/2018 LP5/2014",-765454.54]
["TOTALE",null,null,8070784.3199999994]
[]
[]
[]
["Somma a     Totale utilizzi contributi da Regione per quota FS vincolato",null,null,{"$f":"D19+D22+D23+D24+D25+D26+D27+D28+D29+D30+D31","v":7199516.7300000004},"in accordo con Tabella 36"]

{"sheet":"Tab 52","index":5,"n_rows":22,"n_cols":5,"rows_kept":22,"cut":false,"hidden":false,"merged":[[20,0,21,1],[20,2,21,2],[20,3,21,3],[9,0,9,4],[10,1,11,1],[13,1,13,2],[19,0,19,1],[19,2,19,3],[19,4,19,5],[20,4,20,5],[21,4,21,5]]}
[null,"Tab. 52 – Dettaglio rettifica contributi in conto esercizio per destinazione ad investimenti"]
["CODICE MOD. CE","DETTAGLIO RETTIFICA CONTRIBUTI C/ESERCIZIO\nPER DESTINAZIONE AD INVESTIMENTI","Contributo\nassegnato","Quota destinata ad investimenti","Incidenza %"]
["AA0020","Contributi in c/esercizio da Regione o P.A. per quota F.S. regionale",569244565.85000002,4347846.8099999996,{"$f":"D3/C3","v":7.6379241381211325E-3}]
["AA0060","Contributi in c/esercizio da Regione o P.A. extra fondo",410404.72,0,{"$f":"D4/C4","v":0}]
["AA0110","Contributi in c/esercizio da aziende sanitarie pubbliche (extra fondo)",0,0]
["AA0180","Contributi in c/esercizio per ricerca",0,0]
["AA0230","Contributi in c/esercizio da privati",0,0]
[null,"Totale ",{"$f":"SUM(C3:C7)","v":569654970.57000005},{"$f":"SUM(D3:D7)","v":4347846.8099999996},{"$f":"D8/C8","v":7.6324214386289287E-3}]
[]
["L'importo 2018 della \"Rettifica contributi in c/esercizio per destinazione ad investimenti - da Regione o Provincia Autonoma per quota F.S. Regionale vicolato\" è così determinato:"]
[null,"Descrizione","A","B","A*B"]
[null,null,"% Rettifica","Investimenti","Importo"]
[null,"Rettifica contributi FSR per acquisto beni anno 2018",1,4347846.8099999996,{"$f":"C13*D13","v":4347846.8099999996}]
[null,"TOTALE",null,{"$f":"SUM(D13:D13)","v":4347846.8099999996},{"$f":"SUM(E13:E13)","v":4347846.8099999996}]
[]
[]
[]
[]
["Altre informazioni relative a contributi in conto esercizio"]
["Informazione",null,"Caso presente in azienda?",null,"Se sì, illustrare"]
["CT01. Sono state rilevate significative variazioni rispetto all'esercizio precedente?",null,"SI",null,"L'ammontare dei contribuiti in c/esercizio (voce A1 del Conto Economico ex D.Lgs. 118/2011) subisce, rispetto al 2017, un incremento di circa €/mln 7. "]
[null,null,null,null,"Tale aumento è dovuto essenzialmente alle maggiori somme assegnate nell'esercizio 2018 per quota FSR indistinta rispetto al 2017 (per circa €/mln 8), in parte compensate dalle minori assegnazioni per quota FSR vincolato (per circa -€/mln 1). In particolare, l'incremento della quota FSR indistinta è riconducibile all'aumento del finanziamento per quota capitaria, mentre la diminuzione del finanziamento vincolato è dovuto alla riduzione delle somme assegnate nel 2018 come Obiettivi di PSN 2018, nonchè per rimborso di farmaci innovativi e di farmaci innovativi oncologici.  "]

{"sheet":"Tab 52bis","index":6,"n_rows":21,"n_cols":2,"rows_kept":21,"cut":false,"hidden":false,"merged":[[3,0,3,1],[5,0,5,1]]}
[]
[]
[]
["Ricavi per Payback consuntivo 2018"]
[]
["PAY-BACK 2018\nVOCE CE AA0920 \"Ulteriore Pay-back\"\nVOCE PDC 03.04.05.01.03"]
["DETERMINAZIONI","ASL 203"]
["Determinazione AIFA del 29 settembre 2006 concernente “Manovra per il governo della spesa farmaceutica convenzionata e non convenzionata: Trasferimento da parte delle Aziende farmaceutiche delle somme dovute a titolo diPAY BACK- SPECIALITA' MEDICINALI VARIE' “ \nImpegnato con DPF003/175 DEL 04/12/2018. \nLiquidato con DPF003/199 del 20.12.2018.",837700.76]
["Sconto 1,83% I° semestre 2018.\nImpegnato con DPF003/208 del 31/12/2018, modfiicata con nota prot. n. RA/0007850/19 del 10/01/2019. \nLiquidata con DPF003/11 del 11/02/2019.",555865.38471858238]
["Pay Back 5%\nImpegnato con DPF003/207 del 31/12/2018. \nLiquidato con DPF003/12 del 11/02/2019.",629764.65749737993]
["I semestre 2017 PB 1,83% Integrazione\nImpegnato con DPF003/097/2018.\nLiquidato con DPF003/101 del 08/08/2018.",82973.679999999993]
["II semestre 2017 PB 1,83%. \nImpegnato con DPF003/108/2018.\nLiquidato con DPF003/148/2018.",509394.43]
["Totale voce CE AA0920",{"$f":"SUM(B8:B12)","v":2615698.9122159625}]
[]
[]
["I Ricavi per Pay-back 2018 sono stati contabilizzati nella voce CE AA0920 \"Ulteriore Pay-Back\" "]
["secondo gli importi comunicati dalla Regione nelle Linee Guida alla redazione del Bilancio"]
[" di Esercizio 2018 (Nota prot. n. RA/0122860/DPF012 del 19/04/2019 - Allegato 4)."]
[]
["Non sono stati iscritti nel 2018 ulteriori importi rispetto a quelli comunicati dalla Regione nelle"]
["Linee Guida alla redazione del Bilancio di Esercizio 2018."]

{"sheet":"Tab 53","index":7,"n_rows":62,"n_cols":13,"rows_kept":62,"cut":false,"hidden":false,"merged":[[61,0,65,7],[46,0,46,2],[48,3,52,3],[54,3,55,3],[56,0,56,1],[58,3,58,5],[42,0,43,8],[0,0,0,6],[2,1,2,6],[3,0,4,0],[3,1,4,1],[3,2,3,4],[3,5,3,7]]}
["18.     Proventi e ricavi diversi"]
[]
[null,"Tab. 53 – Dettaglio ricavi per prestazioni sanitarie in mobilità"]
["CODICE MOD. CE","DETTAGLIO RICAVI PER PRESTAZIONI SANITARIE IN MOBILITA'","PUBBLICO",null,null,"PRIVATO",null,null,"TOTALE"]
[null,null,"Avezzano-Sulmona-L'Aquila","Lanciano-Vasto-Chieti","Teramo","Avezzano-Sulmona-L'Aquila","Lanciano-Vasto-Chieti","Teramo",null,null,"VALORE CE","Diff","Ctrl"]
[null," RICAVI DA MOBILITA' SANITARIA INFRAREGIONALE (A)",{"$f":"SUM(C7:C15)","v":10081623.08},30566483.030000001,12194365.770000001,5443181.8900000006,29080855.300000004,12143871.470000001,{"$f":"I7+I8+I9+I10+I11+I12+I13+I14+I15","v":99510381.00999999},null,{"$f":"SUM(K7:K18)","v":99510381.00999999}]
["AA0350","Prestazioni di ricovero",6271288.7400000002,18599541.489999998,6540317.4100000001,2824407.47,20684551.550000001,9012046.1400000006,{"$f":"SUMIF('00 CE'!B:B,'Tab 53'!A7,'00 CE'!G:G)","v":63932152.799999997},null,{"$f":"SUMIF('00 CE'!B:B,'Tab 53'!A7,'00 CE'!G:G)","v":63932152.799999997},{"$f":"I7-K7","v":0},{"$f":"IF(L7=0,\"OK\",\" CTRL\")","v":"OK"}]
["AA0360","Prestazioni di specialistica ambulatoriale",1334805,3180825,1556472,93566.23,1378756.96,951045.01,{"$f":"SUMIF('00 CE'!B:B,'Tab 53'!A8,'00 CE'!G:G)","v":8495470.6699999999},null,{"$f":"SUMIF('00 CE'!B:B,'Tab 53'!A8,'00 CE'!G:G)","v":8495470.6699999999},{"$f":"I8-K8","v":0},{"$f":"IF(L8=0,\"OK\",\" CTRL\")","v":"OK"}]
["AA0370","Prestazioni di psichiatria residenziale e semiresidenziale",0,0,0,706431.69,3083532.85,878021.32,{"$f":"SUMIF('00 CE'!B:B,'Tab 53'!A9,'00 CE'!G:G)","v":4667985.8600000003},null,{"$f":"SUMIF('00 CE'!B:B,'Tab 53'!A9,'00 CE'!G:G)","v":4667985.8600000003},0,"OK"]
["AA0380","Prestazioni di File F",2101925.17,7839259.96,3610091.12,0,0,0,{"$f":"SUMIF('00 CE'!B:B,'Tab 53'!A10,'00 CE'!G:G)","v":13551276.25},null,{"$f":"SUMIF('00 CE'!B:B,'Tab 53'!A10,'00 CE'!G:G)","v":13551276.25},0,"OK"]
["AA0390","Prestazioni servizi MMG, PLS, Contin. assistenziale",20777.580000000002,36973.89,19178.55,0,0,0,{"$f":"SUMIF('00 CE'!B:B,'Tab 53'!A11,'00 CE'!G:G)","v":76930.02},null,{"$f":"SUMIF('00 CE'!B:B,'Tab 53'!A11,'00 CE'!G:G)","v":76930.02},0,"OK"]
["AA0400","Prestazioni servizi farmaceutica convenzionata",317321.84000000003,807142.89,429838.61,0,0,0,{"$f":"SUMIF('00 CE'!B:B,'Tab 53'!A12,'00 CE'!G:G)","v":1554303.34},null,{"$f":"SUMIF('00 CE'!B:B,'Tab 53'!A12,'00 CE'!G:G)","v":1554303.34},0,"OK"]
["AA0410","Prestazioni termali",0,0,0,381959.31,534217.36,155061.79999999999,{"$f":"SUMIF('00 CE'!B:B,'Tab 53'!A13,'00 CE'!G:G)","v":1071238.47},null,{"$f":"SUMIF('00 CE'!B:B,'Tab 53'!A13,'00 CE'!G:G)","v":1071238.47},0,"OK"]
["AA0420","Prestazioni trasporto ambulanze ed elisoccorso",35504.75,102739.8,38468.080000000002,0,0,0,{"$f":"SUMIF('00 CE'!B:B,'Tab 53'!A14,'00 CE'!G:G)","v":176712.63},null,{"$f":"SUMIF('00 CE'!B:B,'Tab 53'!A14,'00 CE'!G:G)","v":176712.63},0,"OK"]
["AA0430","Altre prestazioni sanitarie e socio-sanitarie",0,0,0,1436817.19,3399796.58,1147697.2,{"$f":"SUMIF('00 CE'!B:B,'Tab 53'!A15,'00 CE'!G:G)","v":5984310.9699999997},null,{"$f":"SUMIF('00 CE'!B:B,'Tab 53'!A15,'00 CE'!G:G)","v":5984310.9699999997},0,"OK"]
[]
[null," RICAVI DA MOBILITA' SANITARIA EXTRAREGIONALE (B)",{"$f":"SUM(C18:C28)","v":0},0,0,0,0,0,{"$f":"I18+I19+I20+I21+I22+I23+I24+I25+I26+I27+I28","v":12481662.420000002}]
["AA0460","Prestazioni di ricovero",null,null,null,null,null,null,{"$f":"SUMIF('00 CE'!B:B,'Tab 53'!A18,'00 CE'!G:G)","v":7320391.0700000003}]
["AA0470","Prestazioni di specialistica ambulatoriale",null,null,null,null,null,null,{"$f":"SUMIF('00 CE'!B:B,'Tab 53'!A19,'00 CE'!G:G)","v":1477229.91}]
["AA0480","Prestazioni di psichiatria residenziale e semiresidenziale",null,null,null,null,null,null,{"$f":"SUMIF('00 CE'!B:B,'Tab 53'!A20,'00 CE'!G:G)","v":0}]
["AA0490","Prestazioni di File F",null,null,null,null,null,null,{"$f":"SUMIF('00 CE'!B:B,'Tab 53'!A21,'00 CE'!G:G)","v":2471453.08}]
["AA0500","Prestazioni servizi MMG, PLS, Contin. assistenziale",null,null,null,null,null,null,{"$f":"SUMIF('00 CE'!B:B,'Tab 53'!A22,'00 CE'!G:G)","v":56122.64}]
["AA0510","Prestazioni servizi farmaceutica convenzionata",null,null,null,null,null,null,{"$f":"SUMIF('00 CE'!B:B,'Tab 53'!A23,'00 CE'!G:G)","v":506661.23}]
["AA0520","Prestazioni termali",null,null,null,null,null,null,{"$f":"SUMIF('00 CE'!B:B,'Tab 53'!A24,'00 CE'!G:G)","v":180073.68}]
["AA0530","Prestazioni trasporto ambulanze ed elisoccorso",null,null,null,null,null,null,{"$f":"SUMIF('00 CE'!B:B,'Tab 53'!A25,'00 CE'!G:G)","v":469730.81}]
["AA0540","Altre prestazioni sanitarie e socio-sanitarie",null,null,null,null,null,null,{"$f":"SUMIF('00 CE'!B:B,'Tab 53'!A26,'00 CE'!G:G)","v":0}]
["AA0550","Ricavi per cessione di emocomponenti e cellule staminali",null,null,null,null,null,null,{"$f":"SUMIF('00 CE'!B:B,'Tab 53'!A27,'00 CE'!G:G)","v":0}]
["AA0560","Ricavi per differenziale tariffe TUC",null,null,null,null,null,null,{"$f":"SUMIF('00 CE'!B:B,'Tab 53'!A28,'00 CE'!G:G)","v":0}]
[]
[null," TOTALE RICAVI DA MOBILITA' (A+B)",{"$f":"C6+C17","v":10081623.08},{"$f":"D6+D17","v":30566483.030000001},12194365.770000001,5443181.8900000006,29080855.300000004,12143871.470000001,{"$f":"I6+I17","v":111992043.42999999}]
[]
[null," RICAVI PER PRESTAZIONI OGGETTO DI FATTURAZIONE DIRETTA\n INFRAREGIONALE (C)",89971.34,133548.43,7385.11,0,0,0,{"$f":"C32+D32+E32+F32+G32+H32","v":230904.87999999998}]
[]
[null," RICAVI PER PREST. OGGETTO DI FATTUR. DIRETTA EXTRAREGIONALE (D)",null,null,null,null,null,null,2626.39]
[]
[null," TOTALE RICAVI PER PREST. OGGETTO DI FATTURAZ. DIRETTA (C+D)",{"$f":"C32+C34","v":89971.34},133548.43,7385.11,0,0,0,{"$f":"I32+I34","v":233531.27}]
[]
[null," TOTALE RICAVI AZIENDE REGIONE (A+C)",{"$f":"C6+C32","v":10171594.42},{"$f":"D6+D32","v":30700031.460000001},12201750.880000001,5443181.8900000006,29080855.300000004,12143871.470000001,{"$f":"I6+I32","v":99741285.889999986}]
[null," TOTALE RICAVI AZIENDE EXTRA REGIONE (B+D)",null,null,null,null,null,null,{"$f":"I17+I34","v":12484288.810000002}]
[null," TOTALE RICAVI AZIENDE SANITARIE PUBBLICHE (A+B+C+D)",{"$f":"C30+C32+C34","v":10171594.42},30700031.460000001,12201750.880000001,5443181.8900000006,29080855.300000004,12143871.470000001,{"$f":"I38+I39","v":112225574.69999999}]
[]
[]
["Nella riga \"Ricavi per prestazioni oggetto di fatturazione diretta infraregionale\" sono stati inseriti i ricavi conseguiti dall'Azienda nei confronti delle AASSLL della Regione per prestazioni fuori mobilità, oggetto di fatturazione diretta. Tali valori sono stati riconciliati con le AASSLL della Regione alla data del 31/12/2018."]
[]
[]
[]
["TABELLA DI RACCORDO - DETTAGLIO PER PRESTAZIONI SANITARIE IN MOBILITA'"]
["Voce CE","Descrizione","Importo","Voce CE D.Lgs. 118/2011 "]
["AA0340","Ricavi da mobilità sanitaria infraregionale",99510381.010000005,"A4 a)","a"]
["AA0450","Ricavi da mobilità sanitaria extraregionale",12481662.42,null,"a"]
["AA0450","Altre prestazioni sanitarie e sociosanitarie a rilevanza sanitaria non soggette a compensazione extraregione",2626.39]
["AA0450","Altre prestazioni sanitarie a rilevanza sanitaria - Mobilità attiva internazionale",318967.76]
["AA0610","Ricavi per prestazioni sanitarie e sociosanitarie a rilevanza sanitaria erogate da privati v/residenti extraregione in compensazione ",10487489.539999999]
["AA0670","Ricavi per prestazioni sanitarie erogate in regime intramoenia",4238479.07,"A4 b)"]
["AA0440","Ricavi per prestazioni sanitarie e sociosanitarie a rilevanza sanitaria erogate ad altri soggetti pubblici",90381.5,"A4 c)"]
["AA0660","Ricavi per prestazioni sanitarie e sociosanitarie a rilevanza sanitaria erogate a privati",3620504.31]
["Totale ricavi per prestazioni sanitarie e sociosanitarie a rilevanza sanitaria",null,{"$f":"SUM(C49:C56)","v":130750492},"A 4"]
[]
["Somma a","Totale ricavi da mobilità sanitaria",{"$f":"C49+C50","v":111992043.43000001},"in accordo con Tabella 53"]
[]
[]
["I ricavi di mobilità sono aumentati, rispetto al precedente esercizio, di circa 9.819 €/000. Detto incremento è stato determinato per €/000 2.829 dall'aumento dei ricavi per mobilità sanitaria infraregionale e per €/000 6.989 dall'aumento dei ricavi da mobilità sanitaria extraregionale. Nello specifico, la mobilità sanitaria infraregionale è aumentata nel corso del 2018 per effetto sia dell'incremento della mobilità sanitaria da pubblico, in particolare nei confronti della ASL di Lanciano-Vasto-Chieti con riferimento ai ricavi per prestazioni di ricovero (€/000 1.210), sia dell'incremento della mobilità sanitaria da privato, soprattutto a seguito dell'aumento dei ricavi per prestazioni di ricovero nei confronti della ASL di Avezzano-Sulmona-L'Aquila (€/000 473) e nei confronti della ASL di Teramo (€/000 1.089). L'incremento dei ricavi per mobilità sanitaria extraregionale è principalmente ascrivibile all'aumento dei ricavi per prestazioni di ricovero (per €/000 5.766), per prestazioni di servizi di assistenza sanitaria di base (€/000 866) e per prestazioni di assistenza specialistica ambulatoriale (€/000 625) erogate a cittadini residenti al di fuori del territorio regionale. E' opportuno precisare che la mobilità extra regionale viene contabilizzata con due anni di ritardo rispetto all'esercizio di competenza e, come stabilisce il D. Lgs. n. 118/2011, la rilevazione contabile vine e effettuata al netto (+ o -) degli eventuali conguagli. "]

{"sheet":"Tab 54","index":8,"n_rows":33,"n_cols":6,"rows_kept":33,"cut":false,"hidden":false,"merged":[[31,0,31,5],[32,0,32,5],[1,0,2,0],[1,1,2,1],[1,2,2,2],[1,3,2,3],[1,5,2,5],[1,4,2,4]]}
[null,"Tab. 54 – Dettaglio ricavi e costi per prestazioni sanitarie erogate in regime di intramoenia"]
["CODICE MOD. CE","PRESTAZIONI SANITARIE EROGATE\nIN REGIME DI INTRAMOENIA",{"$f":"\"Valore CE \" &'00 Aggregatore'!$F$2","v":"Valore CE 2018"},{"$f":"\"Valore CE \" &'00 Aggregatore'!$F$2 -1","v":"Valore CE 2017"},"Variazioni\nimporto","%"]
[]
["AA0680","Ricavi per prestazioni sanitarie intramoenia - Area ospedaliera",{"$f":"SUMIF('00 CE'!$B:$B,'Tab 54'!$A4,'00 CE'!G:G)","v":80436.56},{"$f":"SUMIF('00 CE'!$B:$B,'Tab 54'!$A4,'00 CE'!F:F)","v":50045.82},{"$f":"C4-D4","v":30390.739999999998},{"$f":"IF(AND(C4=0,D4=0),0,IF(C4=0,\"\",IF(D4=0,\"\",E4/D4)))","v":0.60725830848610329}]
["AA0690","Ricavi per prestazioni sanitarie intramoenia - Area specialistica",{"$f":"SUMIF('00 CE'!$B:$B,'Tab 54'!$A5,'00 CE'!G:G)","v":3326104},{"$f":"SUMIF('00 CE'!$B:$B,'Tab 54'!$A5,'00 CE'!F:F)","v":3252006},{"$f":"C5-D5","v":74098},{"$f":"IF(AND(C5=0,D5=0),0,IF(C5=0,\"\",IF(D5=0,\"\",E5/D5)))","v":2.278532081429124E-2}]
["AA0700","Ricavi per prestazioni sanitarie intramoenia - Area sanità pubblica",{"$f":"SUMIF('00 CE'!$B:$B,'Tab 54'!$A6,'00 CE'!G:G)","v":17534.57},{"$f":"SUMIF('00 CE'!$B:$B,'Tab 54'!$A6,'00 CE'!F:F)","v":22414.54},{"$f":"C6-D6","v":-4879.9700000000012},-0.21771448354505607]
["AA0710","Ricavi per prestazioni sanitarie intramoenia - Consulenze (ex art. 55 c.1 lett. c), d) ed ex art. 57-58)",{"$f":"SUMIF('00 CE'!$B:$B,'Tab 54'!$A7,'00 CE'!G:G)","v":677848.85},{"$f":"SUMIF('00 CE'!$B:$B,'Tab 54'!$A7,'00 CE'!F:F)","v":478823.7},{"$f":"C7-D7","v":199025.14999999997},0.4156543420887478]
["AA0720","Ricavi per prestazioni sanitarie intramoenia - Consulenze (ex art. 55 c.1 lett. c), d) ed ex art. 57-58) (Aziende sanitarie pubbliche della Regione)",{"$f":"SUMIF('00 CE'!$B:$B,'Tab 54'!$A8,'00 CE'!G:G)","v":0},{"$f":"SUMIF('00 CE'!$B:$B,'Tab 54'!$A8,'00 CE'!F:F)","v":0},{"$f":"C8-D8","v":0},0]
["AA0730","Ricavi per prestazioni sanitarie intramoenia - Altro",{"$f":"SUMIF('00 CE'!$B:$B,'Tab 54'!$A9,'00 CE'!G:G)","v":130775.39},{"$f":"SUMIF('00 CE'!$B:$B,'Tab 54'!$A9,'00 CE'!F:F)","v":97870.17},{"$f":"C9-D9","v":32905.22},0.33621296458359073]
["AA0740","Ricavi per prestazioni sanitarie intramoenia - Altro (Aziende sanitarie pubbliche della Regione)",{"$f":"SUMIF('00 CE'!$B:$B,'Tab 54'!$A10,'00 CE'!G:G)","v":5779.7},{"$f":"SUMIF('00 CE'!$B:$B,'Tab 54'!$A10,'00 CE'!F:F)","v":18272.099999999999},{"$f":"C10-D10","v":-12492.399999999998},-0.68368715144947756]
[null,"TOTALE RICAVI INTRAMOENIA",{"$f":"SUM(C4:C10)","v":4238479.07},{"$f":"SUM(D4:D10)","v":3919432.33},319046.74000000022,8.1401262513951911E-2]
["BA1210","Compartecipazione al personale per att. libero professionale intramoenia - Area ospedaliera",{"$f":"SUMIF('00 CE'!$B:$B,'Tab 54'!$A12,'00 CE'!G:G)","v":54218.100000000006},{"$f":"SUMIF('00 CE'!$B:$B,'Tab 54'!$A12,'00 CE'!F:F)","v":36801.340000000004},17416.760000000002,0.47326428874600762]
["BA1220","Compartecipazione al personale per att. libero professionale intramoenia- Area specialistica",{"$f":"SUMIF('00 CE'!$B:$B,'Tab 54'!$A13,'00 CE'!G:G)","v":2563747.4700000002},{"$f":"SUMIF('00 CE'!$B:$B,'Tab 54'!$A13,'00 CE'!F:F)","v":2790651.77},-226904.29999999981,-8.1308711620439775E-2]
["BA1230","Compartecipazione al personale per att. libero professionale intramoenia - Area sanità pubblica",{"$f":"SUMIF('00 CE'!$B:$B,'Tab 54'!$A14,'00 CE'!G:G)","v":15233.61},{"$f":"SUMIF('00 CE'!$B:$B,'Tab 54'!$A14,'00 CE'!F:F)","v":19073.689999999999},-3840.0799999999981,-0.2013286364620584]
["BA1240","Compartecipazione al personale per att. libero professionale intramoenia - Consulenze (ex art. 55 c.1 lett. c), d) ed ex Art. 57-58)",{"$f":"SUMIF('00 CE'!$B:$B,'Tab 54'!$A15,'00 CE'!G:G)","v":579327.30000000005},{"$f":"SUMIF('00 CE'!$B:$B,'Tab 54'!$A15,'00 CE'!F:F)","v":371493.34},207833.96000000002,0.55945541311723113]
["BA1250","Compartecipazione al personale per att. libero professionale intramoenia- Consulenze (ex art. 55 c.1 lett. c), d) ed ex Art. 57-58) (Aziende sanitarie pubbliche della Regione)",{"$f":"SUMIF('00 CE'!$B:$B,'Tab 54'!$A16,'00 CE'!G:G)","v":0},{"$f":"SUMIF('00 CE'!$B:$B,'Tab 54'!$A16,'00 CE'!F:F)","v":0},0,0]
["BA1260","Compartecipazione al personale per att. libero professionale intramoenia - Altro",{"$f":"SUMIF('00 CE'!$B:$B,'Tab 54'!$A17,'00 CE'!G:G)","v":108504.84},{"$f":"SUMIF('00 CE'!$B:$B,'Tab 54'!$A17,'00 CE'!F:F)","v":75468.47},33036.369999999995,0.43775062618865856]
["BA1270","Compartecipazione al personale per att. libero  professionale intramoenia- Altro (Aziende sanitarie pubbliche della Regione)",{"$f":"SUMIF('00 CE'!$B:$B,'Tab 54'!$A18,'00 CE'!G:G)","v":0},{"$f":"SUMIF('00 CE'!$B:$B,'Tab 54'!$A18,'00 CE'!F:F)","v":0},0,0]
[null,"TOTALE QUOTE RETROCESSE AL PERSONALE (ESCLUSO IRAP)",{"$f":"SUM(C12:C18)","v":3321031.3200000003},{"$f":"SUM(D12:D18)","v":3293488.61},27542.710000000225,8.3627767578647334E-3]
[null,"Indennità di esclusività medica per attività di libera professione",0,0,0,0]
["YA0040","IRAP relativa ad attività di libera professione (intramoenia)",261166.86,275247.39,-14080.530000000028,{"$f":"IF(C21=0,0,ROUND(E21/C21,4))","v":-5.3900000000000003E-2}]
[null,"Costi diretti aziendali",null,305194,null,0]
[null,"Costi generali aziendali",null,33116.929999999993,null,0]
["**","Fondo di perequazione",null,0,null,0]
[null,"TOTALE ALTRI COSTI INTRAMOENIA",{"$f":"SUM(C20:C24)","v":261166.86},{"$f":"SUM(D20:D24)","v":613558.32000000007},null,0]
[null,"RICAVI - COSTI INTRAMOENIA",{"$f":"C11-(C19+C25)","v":656280.89000000013},{"$f":"D11-(D19+D25)","v":12385.400000000373},null,0]
[]
[]
["YA0040","IRAP relativa ad attività di libera professione (intramoenia)",418750.77,458072.41000000003]
["*","Scostamento Voce CE vs Tabella 54",{"$f":"C21-C29","v":-157583.91000000003},{"$f":"D21-D29","v":-182825.02000000002}]
[]
["* Lo scostamento evidenziato si riferisce al conto 1101030102 \"IRAP libera professione relativa ad attività istituzionale (ex. art. 55 c. 2 CCNL)\""]
["** Il valore del Fondo di Perequazione è contabilizzato nelle voci di CE relative al TOTALE QUOTE RETROCESSE AL PERSONALE (ESCLUSO IRAP) - Tab 54"]

{"sheet":"Tab 55","index":9,"n_rows":29,"n_cols":7,"rows_kept":29,"cut":false,"hidden":false,"merged":[[26,0,26,1],[27,0,27,1],[27,2,27,3],[27,4,27,7],[28,0,28,1],[28,4,28,7]]}
[null,"Tab. 55 – Dettaglio rimborsi da aziende sanitarie pubbliche della Regione per acquisti di beni "]
[null,"DETTAGLIO RIMBORSI DA \nAZIENDE SANITARIE PUBBLICHE DELLA REGIONE\nPER ACQUISTI DI BENI ","Azienda …","Azienda …","Azienda …","Azienda …","TOTALE"]
[null,"Prodotti farmaceutici ed emoderivati:"]
[null,"Medicinali con AIC, ad eccezione di vaccini ed emoderivati di produzione regionale"]
[null,"Medicinali senza AIC"]
[null,"Emoderivati di produzione regionale"]
[null,"Sangue ed emocomponenti"]
[null,"Dispositivi medici:"]
[null,"Dispositivi medici"]
[null,"Dispositivi medici impiantabili attivi"]
[null,"Dispositivi medico diagnostici in vitro (IVD)"]
[null,"Prodotti dietetici"]
[null,"Materiali per la profilassi (vaccini)"]
[null,"Prodotti chimici"]
[null,"Materiali e prodotti per uso veterinario"]
[null,"Altri beni e prodotti sanitari"]
[null,"Prodotti alimentari"]
[null,"Materiali di guardaroba, di pulizia e di convivenza in genere"]
[null,"Combustibili, carburanti e lubrificanti"]
[null,"Supporti informatici e cancelleria"]
[null,"Materiale per la manutenzione"]
[null,"Altri beni e prodotti non sanitari"]
[null,"TOTALE"]
[]
[]
[]
["Altre informazioni relative a proventi e ricavi diversi"]
["Informazione",null,"Caso presente in azienda?",null,"Se sì, illustrare"]
["CT01. Sono state rilevate significative variazioni rispetto all'esercizio precedente?",null,null,"NO"]

{"sheet":"Tab 56-57","index":10,"n_rows":38,"n_cols":7,"rows_kept":38,"cut":false,"hidden":false,"merged":[[13,1,13,5],[0,0,0,1],[2,1,2,5],[3,1,4,1],[3,2,3,3],[3,4,4,4],[3,5,4,5]]}
["19.     Acquisti di beni"]
[]
[null,"Tab. 56 – Dettaglio acquisti di beni sanitari per tipologia di distribuzione "]
[null,"DETTAGLIO ACQUISTI DI BENI SANITARI\nPER TIPOLOGIA DI DISTRIBUZIONE","Distribuzione",null,"Consumi Ospedalieri","TOTALE"]
[null,null,"Diretta","Per conto"]
[null,"Prodotti farmaceutici ed emoderivati:",47809354.829999998,8238869.5199999996,26488412.740000017,{"$f":"C6+D6+E6","v":82536637.090000004}]
[null,"Medicinali con AIC, ad eccezione di vaccini ed emoderivati di produzione regionale",0,0,0,{"$f":"C7+D7+E7","v":0}]
[null,"Medicinali senza AIC",0,0,752264.34,752264.34]
[null,"Emoderivati di produzione regionale",0,0,0,0]
[null,"Prodotti dietetici",0,0,0,0]
[null,"TOTALE",{"$f":"SUM(C6:C10)","v":47809354.829999998},{"$f":"SUM(D6:D10)","v":8238869.5199999996},27240677.080000017,83288901.430000007]
[]
[]
[null,"Tab. 57 – Dettaglio acquisti di beni da aziende sanitarie pubbliche "]
["CODICE MOD. CE","DETTAGLIO ACQUISTI DI BENI DA \nAZIENDE SANITARIE PUBBLICHE DELLA REGIONE","Azienda …","Azienda …","Azienda …","Azienda ","TOTALE"]
["BA0030","Prodotti farmaceutici ed emoderivati:",null,null,null,null,{"$f":"SUMIF('00 CE'!B:B,'Tab 56-57'!A16,'00 CE'!G:G)","v":83288901.429999992}]
["BA0040","Medicinali con AIC, ad eccezione di vaccini ed emoderivati di produzione regionale",null,null,null,null,{"$f":"SUMIF('00 CE'!B:B,'Tab 56-57'!A17,'00 CE'!G:G)","v":82536637.089999989}]
["BA0050","Medicinali senza AIC",null,null,null,null,{"$f":"SUMIF('00 CE'!B:B,'Tab 56-57'!A18,'00 CE'!G:G)","v":752264.34}]
["BA0060","Emoderivati di produzione regionale",null,null,null,null,{"$f":"SUMIF('00 CE'!B:B,'Tab 56-57'!A19,'00 CE'!G:G)","v":0}]
["BA0070","Sangue ed emocomponenti",null,null,null,null,{"$f":"SUMIF('00 CE'!B:B,'Tab 56-57'!A20,'00 CE'!G:G)","v":23080.75}]
["BA0210","Dispositivi medici:",null,null,null,null,{"$f":"SUMIF('00 CE'!B:B,'Tab 56-57'!A21,'00 CE'!G:G)","v":42871861.68}]
["BA0220","Dispositivi medici",null,null,null,null,{"$f":"SUMIF('00 CE'!B:B,'Tab 56-57'!A22,'00 CE'!G:G)","v":27013313.950000003}]
["BA0230","Dispositivi medici impiantabili attivi",null,null,null,null,{"$f":"SUMIF('00 CE'!B:B,'Tab 56-57'!A23,'00 CE'!G:G)","v":3071999.01}]
["BA0240","Dispositivi medico diagnostici in vitro (IVD)",null,null,null,null,{"$f":"SUMIF('00 CE'!B:B,'Tab 56-57'!A24,'00 CE'!G:G)","v":12786548.720000001}]
["BA0250","Prodotti dietetici",null,null,null,null,{"$f":"SUMIF('00 CE'!B:B,'Tab 56-57'!A25,'00 CE'!G:G)","v":468960.66}]
["BA0260","Materiali per la profilassi (vaccini)",null,null,null,null,{"$f":"SUMIF('00 CE'!B:B,'Tab 56-57'!A26,'00 CE'!G:G)","v":2222785.11}]
["BA0270","Prodotti chimici",null,null,null,null,{"$f":"SUMIF('00 CE'!B:B,'Tab 56-57'!A27,'00 CE'!G:G)","v":0}]
["BA0280","Materiali e prodotti per uso veterinario",null,null,null,null,{"$f":"SUMIF('00 CE'!B:B,'Tab 56-57'!A28,'00 CE'!G:G)","v":20636.41}]
["BA0290","Altri beni e prodotti sanitari",null,null,null,null,{"$f":"SUMIF('00 CE'!B:B,'Tab 56-57'!A29,'00 CE'!G:G)","v":2193506.59}]
["BA0300","Beni e prodotti sanitari da Aziende sanitarie pubbliche della Regione",null,null,null,null,{"$f":"SUMIF('00 CE'!B:B,'Tab 56-57'!A30,'00 CE'!G:G)","v":0}]
["BA0320","Prodotti alimentari",null,null,null,null,{"$f":"SUMIF('00 CE'!B:B,'Tab 56-57'!A31,'00 CE'!G:G)","v":83.52}]
["BA0330","Materiali di guardaroba, di pulizia e di convivenza in genere",null,null,null,null,{"$f":"SUMIF('00 CE'!B:B,'Tab 56-57'!A32,'00 CE'!G:G)","v":64306.42}]
["BA0340","Combustibili, carburanti e lubrificanti",null,null,null,null,{"$f":"SUMIF('00 CE'!B:B,'Tab 56-57'!A33,'00 CE'!G:G)","v":172419.52}]
["BA0350","Supporti informatici e cancelleria",null,null,null,null,{"$f":"SUMIF('00 CE'!B:B,'Tab 56-57'!A34,'00 CE'!G:G)","v":477974.89999999997}]
["BA0360","Materiale per la manutenzione",null,null,null,null,{"$f":"SUMIF('00 CE'!B:B,'Tab 56-57'!A35,'00 CE'!G:G)","v":239884.37}]
["BA0370","Altri beni e prodotti non sanitari",null,null,null,null,{"$f":"SUMIF('00 CE'!B:B,'Tab 56-57'!A36,'00 CE'!G:G)","v":45073.96}]
["BA0380","Beni e prodotti non sanitari da Aziende sanitarie pubbliche della Regione",null,null,null,null,{"$f":"SUMIF('00 CE'!B:B,'Tab 56-57'!A37,'00 CE'!G:G)","v":0}]
[null,"TOTALE",null,null,null,null,{"$f":"G16+G20+G21+G25+G26+G27+G28+G29+G30+G32+G31+G33+G34+G35+G36","v":132089475.31999998}]

{"sheet":"AB01-02-03","index":11,"n_rows":22,"n_cols":5,"rows_kept":22,"cut":false,"hidden":false,"merged":[[21,0,21,6],[13,0,13,6],[20,0,20,6],[12,0,12,6],[15,0,15,6],[14,0,14,6],[9,0,10,6],[19,0,19,6],[1,1,1,6],[5,4,5,6],[6,4,6,6],[4,4,4,6],[6,0,6,1],[4,0,4,1],[4,2,4,3],[5,0,5,1],[17,0,17,6],[11,0,11,6],[16,0,16,6],[18,0,18,6]]}
["AB01 - Acquisti di beni"]
["AB01 ","Ciascuna tipologia di bene, compreso nelle voci relative agli acquisti di beni sanitari e non sanitari, è monitorata attraverso il sistema gestionale del magazzino, che rileva ogni tipologia di movimento, in entrata e in uscita."]
[]
["Altre informazioni relative agli acquisti di beni"]
["Informazione",null,"Caso presente in azienda?",null,"Se SI, illustrare"]
["AB02. Sono stati rilevati costi per acquisto di beni da altre Aziende Sanitarie della Regione? Se sì, di quali tipologie di beni si tratta?",null,null,"NO"]
["AB03. Sono state rilevate significative variazioni rispetto all'esercizio precedente?",null,null,"SI","Si veda commento sottostante."]
[]
[]
["Il costo per acquisti di beni ha subito un incremento del 13% rispetto all'esercizio precedente ( circa 15 €/mln). Tale variazione è dovuta sostanzialmente all'incremento delle seguenti voci: "]
[]
["- i costi di acquisto di prodotti farmaceutici ed emoderivati, in particolare dei medicinali con AIC (+ €/mln 13,3); "]
["- i costi di acquisto dei dispositivi medici (+ €/mln 1,7). "]
["Per il commento di tali variazioni, si fa riferimento, tra l'altro, a quanto comunicato dal Direttore della UOC Farmacia Ospedaliera con e-mail del 03/07/2019."]
["Con riferimento all'incremento del costo per l'acquisto dei farmaci, di circa €/mln 13,3, esso è stato determinato sia dall'inserimento in Prontuario Ospedaliero di nuovi farmaci, sia dallo spostamento delle prescrizioni verso farmaci più costosi (Effetto mix). "]
["In particolare, nel periodo Settembre 2016-Dicembre 2018 sono stati inseriti in Prontuario Ospedaliero nuovi farmaci ad alto costo.  "]
["Tra i farmaci di nuova introduzione e a maggiore impatto di spesa si segnala il \"mepolizumab\" (Nucala) e l'\"omalizumab\" (Xolair), che sono farmaci che non ricadono nella categoria dei farmaci innovativi e quindi non possono essere ammessi al rimborso dello specifico Fondo nazionale."]
["La disponibilità in commercio di nuovi e più costosi farmaci ha determinato un aumento della spesa non soltanto per i nuovi pazienti, ma anche per quelli già trattati, per cui vi è uno spostamento delle prescrizioni verso farmaci più costosi all'interno della stessa categoria terapeutica (Effetto mix). "]
["Inoltre, l'incremento della spesa farmaceutica è stato anche determinato dall'estensione delle indicazioni terapeutiche dei farmaci esistenti. Tale fenomeno è particolarmente presente nell'area ematologica. A tal proposito, presso la ASL di Pescara opera l'unico Dipartimento di Ematologia regionale, su cui, a seguito del depotenziamento di alcune realtà periferiche, confluiscono molti pazienti che venivano precedentemente curati negli altri punti della rete regionale. Nel campo ematologico molti farmaci già in uso nel 2017 hanno avuto recentemente una estensione delle indicazioni da parte di AIFA. "]
["L'aumento della spesa è stato altresì determinato dalla progressiva introduzione di nuove terapie, specialmente in campo oncologico, che prevedono l'utilizzo di farmaci già in uso, ma in associazione tra loro."]
["Infine, all'incremento della spesa farmaceutica ha contribuito l'avvio, dal mese di Agosto 2018, della DPC che ha avuto il duplice effetto, da un lato, di incrementare la spesa farmaceutica ospedaliera, dall'altro di ridurre quella per la farmaceutica convenzionata."]
["Con riferimento ai dispositivi medici, l'incremento di spesa è imputabile sia ai nuovi acquisti della UOC Neurochirurgia, sia alle nuove acquisizioni per i reparti di Ginecologia, Blocco Operatorio, Radiologia, Anestesia e Laboratorio Analisi attraverso la Commissione Terapeutica Aziendale."]

{"sheet":"Tab. 57bis","index":12,"n_rows":55,"n_cols":11,"rows_kept":55,"cut":false,"hidden":false,"merged":[[54,0,54,10],[3,1,3,5],[3,7,4,7],[3,8,3,10],[51,2,51,5],[52,2,52,5],[26,0,26,5],[46,0,46,5],[47,0,47,5],[49,2,49,5],[50,2,50,5]]}
[]
[null,null,null,null,null,null,null,null,null,"Tab. 57-bis"]
[]
[null,"Farmaci",null,null,null,null,"Costo CE","Prezzi medi di acquisto  Consuntivo 2018","Importo payback/note di credito ricevute direttamente dalla ASL (prezzo/volume, capping ed altri accordi) Consuntivo 2018"]
["Fondo Inn.","AIC","Denominazione e Confezione","Principio attivo","Data  Efficacia","Data Scadenza","Consuntivo 2018",null,"Riferito ad acquisti 2018","Riferito ad acquisti 2017","Riferito ad acquisti anni precedenti"]
["I","043441029","OLYSIO*28CPS 150MG","simeprevir","2015-06-27","2018-02-23",0,0,0,0,0]
["I","043441017","OLYSIO*7CPS 150MG","simeprevir","2015-06-27","2018-02-23",0,0,0,0,0]
["I","043841016","VIEKIRAX*56CPR 12,5+75+50MG","ombitasvir, paritaprevir e ritonavir","2015-05-24","2018-05-23",0,0,0,0,0]
["I","043840014","EXVIERA*56CPR RIV 250MG","dasabuvir","2015-05-24","2018-05-23",0,0,0,0,0]
["I","043542012","DAKLINZA*28CPR RIV 30MG","daclatasvir","2015-05-05","2018-05-04",0,0,0,0,0]
["I","043542036","DAKLINZA*28CPR RIV 60MG","daclatasvir","2015-05-05","2018-05-04",0,0,9900,78666.64,0]
["I","043519026","KALYDECO*56CPR RIV 150MG","ivacaftor","2015-05-05","2018-05-04",0,0,0,0,0]
["I","044928012","EPCLUSA 1FL 28CPR 400+100MG","sofosbuvir/velpatasvir","2017-04-27","2020-04-26",3079999.78,654.76,2829043.65,0,0]
["I","044929014","ZEPATIER 28CPR RIV 50MG+100MG","elbasvir/grazoprevir","2017-02-04","2020-02-03",324133.65999999997,82.69,22733.34,0,0]
["I","044880019","STRIMVELIS EV 1-10MILIONI CELL","cellule autologhe CD34+","2016-08-16","2019-08-15",0,0,0,0,0]
["I","045426018","SPINRAZA*1FL 12MG 5ML 2,4MG/ML","nusinersen","2017-09-28","2020-09-27",229460,57365,77000,0,0]
["I","045445018","MAVIRET*84CPR RIV 100MG+40MG","glecaprevir/pibrentasvir","2017-09-28","2020-04-26",1024616.22,45.68,118705.18,0,0]
["I","045383015","OXERVATE*COLL 7FL 20MCG/ML 1ML","cenegermin","2018-01-24","2021-01-23",0,0,0,0,0]
["I","045494010","VOSEVI*28CPR 400+100+100MG FL","sofosbuvir/velpatasvir/voxilaprevir","2018-04-19","2020-04-26",125885.69,642.27,99705.69,0,0]
[null,"045676069","DUPIXENT*2SIR 300MG 2ML","dupilumab","2018-09-08","2021-09-07",11897.6,457.6,0,0,0]
[null,"046130023","HEMLIBRA*SC 150MG/ML 0,4ML","emicizumab","2018-12-07","2021-12-06",0,0,0,0,0]
[null,"046130035","HEMLIBRA*SC 150MG/ML 0,7ML","emicizumab","2018-12-07","2021-12-06",0,0,0,0,0]
[null,"046130047","HEMLIBRA*SC 150MG/ML 1ML","emicizumab","2018-12-07","2021-12-06",0,0,0,0,0]
[null,"046130011","HEMLIBRA*SC 30MG/ML 1ML","emicizumab","2018-12-07","2021-12-06",0,0,0,0,0]
[null,"045890011","PREVYMIS*28CPR RIV 240MG","letermovir","2018-09-18","2021-09-17",0,0,0,0,0]
[null,"045890023","PREVYMIS*28CPR RIV 480MG","letermovir","2018-09-18","2021-09-17",0,0,0,0,0]
["FONDO INNOVATIVI NON ONCOLOGICI",null,null,null,null,null,{"$f":"SUM(G6:G26)","v":4795992.95},null,{"$f":"SUM(I6:I26)","v":3157087.86},78666.64,0]
["IO","039399011","ABRAXANE*INF 100MG 5MG/ML","paclitaxel","2015-02-21","2018-02-20",173499.77,237.67,3398.39,0,0]
["IO","043620018","ZYDELIG*FL 60CPR RIV 100MG","idelalisib","2015-09-11","2018-09-10",29598.71,49.33,0,0,0]
["IO","043620020","ZYDELIG*FL 60CPR RIV 150MG","idelalisib","2015-09-11","2018-09-10",101417.02,49.71,0,0,0]
["IO","043693023","IMBRUVICA*FL 120CPS 140MG","ibrutinib","2016-01-05","2019-01-04",0,0,0,0,0]
["IO","043693011","IMBRUVICA*FL 90CPS 140MG","ibrutinib","2016-01-05","2019-01-04",574696.59,49.12,0,0,0]
["IO","044291021","OPDIVO*INFUS 1F 10ML 10MG/ML","nivolumab","2016-03-25","2019-03-24",914760,1169.77,0,0,0]
["IO","044291019","OPDIVO*INFUS 1F 4ML 10MG/ML","nivolumab","2016-03-25","2019-03-24",183162.1,469.65,0,0,0]
["IO","044386011","KEYTRUDA*1FL POLV EV 50MG/ML","pembrolizumab","2016-05-11","2019-05-10",268669.5,1414.05,0,0,0]
["IO","044386023","KEYTRUDA*1FL 4ML 25MG/ML                ","pembrolizumab","2016-05-11","2019-05-10",1117099.5,2828.1,0,0,0]
["IO","042927018","IMNOVID*21CPS 1MG","pomalidomide","2018-02-21","2018-08-19",0,0,0,0,0]
["IO","042927020","IMNOVID*21CPS 2MG","pomalidomide","2018-02-21","2018-08-19",22770.6,361.44,0,0,0]
["IO","042927032","IMNOVID*21CPS 3MG","pomalidomide","2018-02-21","2018-08-19",22770.6,361.44,0,0,0]
["IO","042927044","IMNOVID*21CPS 4MG","pomalidomide","2018-02-21","2018-08-19",164447.45000000001,372.9,0,0,0]
["IO","044885022","DARZALEX*EV 1FL 20ML 20MG/ML","daratumumab","2018-04-19","2019-04-18",460120.24,1870.41,31123.82,0,0]
["IO","044885010","DARZALEX*EV 1FL 5ML 20MG/ML","daratumumab","2018-04-19","2019-04-18",89311.52,467.6,7111.94,0,0]
[null,"045267010","ALECENSA*224CPS 150MG","alectinib","2018-08-01","2020-01-31",38884.03,21.7,0,0,0]
[null,"045427010","QARZIBA*1FL 4,5ML 4,5MG/ML","dinutuximab beta","2018-08-01","2021-07-31",0,0,0,0,0]
[null,"045612013","RYDAPT*112CPS MOLLI 25MG","midostaurina","2018-08-17","2021-08-16",9983.9599999999991,89.14,0,0,0]
[null,"045590015","TECENTRIQ*INFUS 60MG/ML 20ML","atezolizumab","2018-07-15","2019-03-24",6278.16,3139.08,0,0,0]
["FONDO INNOVATIVI ONCOLOGICI",null,null,null,null,null,{"$f":"SUM(G28:G46)","v":4177469.75},null,{"$f":"SUM(I28:I46)","v":41634.15},0,0]
["TOTALE GENERALE",null,null,null,null,null,{"$f":"SUM(G47,G27)","v":8973462.6999999993},null,{"$f":"SUM(I47,I27)","v":3198722.01},78666.64,0]
[]
[null,null,"FONDO INNOVATIVI NETTO"]
[null,null,"Fondo innovativi non oncologici",null,null,null,{"$f":"G27-(I27+J27)","v":1560238.4500000002}]
[null,null,"Fondo innovativi oncologici",null,null,null,{"$f":"G47-(I47+K47)","v":4135835.6}]
[null,null,"TOTALE GENERALE",null,null,null,{"$f":"SUM(G51:G52)","v":5696074.0500000007}]
[]
["NOTA: Come specificato dal Dirigente dell'UOSD Controllo di Gestione con e-mail del 02 Luglio 2019, la tabella 57-bis è redatta in base ai dati dell’evaso e non delle fatture, anche perché dalle fatture non sarebbe desumibile il costo medio di acquisto. "]

{"sheet":"Tab 58","index":13,"n_rows":48,"n_cols":13,"rows_kept":48,"cut":false,"hidden":false,"merged":[[47,0,47,8],[44,0,45,8],[0,0,0,5],[2,1,2,8],[3,0,4,0],[3,1,4,1],[3,2,3,4],[3,5,3,7],[3,8,4,8]]}
["20.     Acquisti di servizi"]
[]
[null,"Tab. 58 – Dettaglio acquisti di servizi sanitari in mobilità"]
["CODICE MOD. CE","DETTAGLIO ACQUISTI DI SERVIZI SANITARI IN MOBILITA'","PUBBLICO",null,null,"PRIVATO",null,null,"TOTALE"]
[null,null,"Avezzano-Sulmona-L'Aquila","Lanciano-Vasto-Chieti","Teramo","Avezzano-Sulmona-L'Aquila","Lanciano-Vasto-Chieti","Teramo",null,null,"VALORE CE","Diff","Ctrl"]
[null,"COSTI DA MOBILITA' SANITARIA INFRAREGIONALE (A)",{"$f":"SUM(C7:C18)","v":3680762.67},28263793.580000002,5360168.1099999994,1705586.0899999999,8031763.6699999999,2345506.63,49387581.230000004,null,49387581.230000004]
["BA0470","Acquisti servizi sanitari per medicina di base",6337.26,24927.21,7406.55,0,0,0,{"$f":"SUMIF('00 CE'!B:B,'Tab 58'!A7,'00 CE'!G:G)","v":38671},null,{"$f":"SUMIF('00 CE'!B:B,'Tab 58'!A7,'00 CE'!G:G)","v":38671},{"$f":"I7-K7","v":0},{"$f":"IF(L7=0,\"OK\",\" CTRL\")","v":"OK"}]
["BA0510","Acquisti servizi sanitari per farmaceutica",224285.24,896880.25,156462.57999999999,0,0,0,{"$f":"SUMIF('00 CE'!B:B,'Tab 58'!A8,'00 CE'!G:G)","v":1277628.07},null,{"$f":"SUMIF('00 CE'!B:B,'Tab 58'!A8,'00 CE'!G:G)","v":1277628.07},{"$f":"I8-K8","v":0},{"$f":"IF(L8=0,\"OK\",\" CTRL\")","v":"OK"}]
["BA0540","Acquisti servizi sanitari per assistenza specialistica ambulatoriale",615759,5975232,1032519,44634.720000000001,1207930.3600000001,3284.09,{"$f":"SUMIF('00 CE'!B:B,'Tab 58'!A9,'00 CE'!G:G)","v":8879359.5700000003},null,{"$f":"SUMIF('00 CE'!B:B,'Tab 58'!A9,'00 CE'!G:G)","v":8879359.5700000003},0,"OK"]
["BA0650","Acquisti servizi sanitari per assistenza riabilitativa",0,0,0,122620.66,2392039.63,2318305.66,{"$f":"SUMIF('00 CE'!B:B,'Tab 58'!A10,'00 CE'!G:G)","v":4832965.95},null,{"$f":"SUMIF('00 CE'!B:B,'Tab 58'!A10,'00 CE'!G:G)","v":4832965.95},0,"OK"]
["BA0710","Acquisti servizi sanitari per assistenza integrativa",0,0,0,0,0,0,{"$f":"SUMIF('00 CE'!B:B,'Tab 58'!A11,'00 CE'!G:G)","v":0},null,{"$f":"SUMIF('00 CE'!B:B,'Tab 58'!A11,'00 CE'!G:G)","v":0},0,"OK"]
["BA0760","Acquisti servizi sanitari per assistenza protesica",0,0,0,0,0,0,{"$f":"SUMIF('00 CE'!B:B,'Tab 58'!A12,'00 CE'!G:G)","v":0},null,{"$f":"SUMIF('00 CE'!B:B,'Tab 58'!A12,'00 CE'!G:G)","v":0},0,"OK"]
["BA0810","Acquisti servizi sanitari per assistenza ospedaliera",2695124.36,17202456.41,3900006.16,968473.52,1715471.87,0,{"$f":"SUMIF('00 CE'!B:B,'Tab 58'!A13,'00 CE'!G:G)","v":26481532.390000001},null,{"$f":"SUMIF('00 CE'!B:B,'Tab 58'!A13,'00 CE'!G:G)","v":26481532.390000001},0,"OK"]
["BA0910","Acquisto prestazioni di psichiatria residenziale e semiresidenziale",0,0,0,527515.46,1024060.04,0,{"$f":"SUMIF('00 CE'!B:B,'Tab 58'!A14,'00 CE'!G:G)","v":1551575.5},null,{"$f":"SUMIF('00 CE'!B:B,'Tab 58'!A14,'00 CE'!G:G)","v":1551575.5},0,"OK"]
["BA0970","Acquisto prestazioni di distribuzione farmaci File F",123093.52,4088699.33,252319.52,0,0,0,{"$f":"SUMIF('00 CE'!B:B,'Tab 58'!A15,'00 CE'!G:G)","v":4464112.37},null,{"$f":"SUMIF('00 CE'!B:B,'Tab 58'!A15,'00 CE'!G:G)","v":4464112.37},0,"OK"]
["BA1040","Acquisto prestazioni termali in convenzione",0,0,0,0,0,0,{"$f":"SUMIF('00 CE'!B:B,'Tab 58'!A16,'00 CE'!G:G)","v":0},null,{"$f":"SUMIF('00 CE'!B:B,'Tab 58'!A16,'00 CE'!G:G)","v":0},0,"OK"]
["BA1100","Acquisto prestazioni trasporto sanitario",16163.29,75598.38,11454.3,0,0,0,{"$f":"SUMIF('00 CE'!B:B,'Tab 58'!A17,'00 CE'!G:G)","v":103216},null,{"$f":"SUMIF('00 CE'!B:B,'Tab 58'!A17,'00 CE'!G:G)","v":103216},0,"OK"]
["BA1150","Acquisto prestazioni Socio-Sanitarie a rilevanza sanitaria",0,0,0,42341.73,1692261.77,23916.880000000001,{"$f":"SUMIF('00 CE'!B:B,'Tab 58'!A18,'00 CE'!G:G)","v":1758520.3800000001},null,{"$f":"SUMIF('00 CE'!B:B,'Tab 58'!A18,'00 CE'!G:G)","v":1758520.3800000001},0,"OK"]
[]
[null,"COSTI DA MOBILITA' SANITARIA EXTRAREGIONALE (B)",{"$f":"SUM(C21:C29)","v":0},0,0,0,0,0,{"$f":"SUM(I21:I29)","v":31368215.52}]
["BA0480","Acquisti servizi sanitari per medicina di base",null,null,null,null,null,null,{"$f":"SUMIF('00 CE'!B:B,'Tab 58'!A21,'00 CE'!G:G)","v":217107.5}]
["BA0520","Acquisti servizi sanitari per farmaceutica",null,null,null,null,null,null,{"$f":"SUMIF('00 CE'!B:B,'Tab 58'!A22,'00 CE'!G:G)","v":457054.73}]
["BA0560","Acquisti servizi sanitari per assistenza specialistica ambulatoriale",null,null,null,null,null,null,{"$f":"SUMIF('00 CE'!B:B,'Tab 58'!A23,'00 CE'!G:G)","v":4000753.58}]
["BA0730","Acquisti servizi sanitari per assistenza integrativa",null,null,null,null,null,null,{"$f":"SUMIF('00 CE'!B:B,'Tab 58'!A24,'00 CE'!G:G)","v":0}]
["BA0780","Acquisti servizi sanitari per assistenza protesica",null,null,null,null,null,null,{"$f":"SUMIF('00 CE'!B:B,'Tab 58'!A25,'00 CE'!G:G)","v":0}]
["BA0830","Acquisti servizi sanitari per assistenza ospedaliera",null,null,null,null,null,null,{"$f":"SUMIF('00 CE'!B:B,'Tab 58'!A26,'00 CE'!G:G)","v":24057993.460000001}]
["BA0990","Acquisto prestazioni di distribuzione farmaci e File F",null,null,null,null,null,null,{"$f":"SUMIF('00 CE'!B:B,'Tab 58'!A27,'00 CE'!G:G)","v":2195879.04}]
["BA1060","Acquisto prestazioni termali in convenzione",null,null,null,null,null,null,{"$f":"SUMIF('00 CE'!B:B,'Tab 58'!A28,'00 CE'!G:G)","v":95302.31}]
["BA1120","Acquisto prestazioni trasporto sanitario",null,null,null,null,null,null,{"$f":"SUMIF('00 CE'!B:B,'Tab 58'!A29,'00 CE'!G:G)","v":344124.9}]
[]
[null,"TOTALE COSTI DA MOBILITA' (A+B)",{"$f":"C6+C20","v":3680762.67},{"$f":"D6+D20","v":28263793.580000002},5360168.1099999994,1705586.0899999999,8031763.6699999999,2345506.63,{"$f":"I6+I20","v":80755796.75}]
[]
[null,"COSTI PER PRESTAZIONI OGGETTO DI FATTURAZIONE DIRETTA INFRAREGIONALE (C)",347130,42621,149491.81,0,0,0,{"$f":"SUM(C33:H33)","v":539242.81000000006}]
[]
[null,"COSTI PER PREST. OGGETTO DI FATTUR. DIRETTA EXTRAREGIONALE (D)",null,null,null,null,null,null,326087.32]
[]
[null,"TOTALE COSTI PER PREST. OGGETTO DI FATTURAZ. DIRETTA (C+D)",{"$f":"C33+C35","v":347130},42621,149491.81,0,0,0,{"$f":"SUM(C37:H37)+I35","v":865330.13000000012}]
[]
[null,"TOTALE COSTI AZIENDE REGIONE (A+C)",{"$f":"C33+C6","v":4027892.67},28306414.580000002,5509659.919999999,1705586.0899999999,8031763.6699999999,2345506.63,{"$f":"I33+I6","v":49926824.040000007}]
[null,"TOTALE COSTI AZIENDE EXTRA REGIONE (B+D)",null,null,null,null,null,null,{"$f":"I20+I35","v":31694302.84}]
[null,"TOTALE COSTI AZIENDE SANITARIE PUBBLICHE (A+B+C+D)",{"$f":"C31+C33+C35","v":4027892.67},28306414.580000002,5509659.919999999,1705586.0899999999,8031763.6699999999,{"$f":"H31+H33+H35","v":2345506.63},{"$f":"I31+I33+I35","v":81621126.879999995}]
[]
[]
[]
["Nella riga \"Costi per prestazioni oggetto di fatturazione diretta infraregionale\" sono stati inseriti i costi sostenuti dall'Azienda nei confronti delle AASSLL della Regione per prestazioni fuori mobilità, oggetto di fatturazione diretta. Tali valori sono stati riconciliati con le AASSLL della Regione alla data del 31/12/2018."]
[]
[]
["I costi di mobilità passiva sono diminuiti, rispetto al precedente esercizio, di circa €/000 571. Detta variazione è stata determinata dalla riduzione dei costi per mobilità sanitaria infraregionale (-€/000 1.884), parzialmente compensata dall'incremento dei costi per mobilità sanitaria extraregionale (+ €/000 1.313). Nello specifico, i saldi della mobilità passiva infraregionale sono migliorati soprattutto a causa dei minori costi di acquisto di servizi sanitari per assistenza ospedaliera (per - €/000 1.748) rispetto al 2017, in particolare nei confronti della ASL di Lanciano-Vasto-Chieti.   I costi per mobilità sanitaria extraregionale sono aumentati nel corso del 2018 principalmente per effetto dell'incremento dei costi per acquisti di servizi sanitari per assistenza ospedaliera (per €/000 1.009) e per acquisto prestazioni di distribuzione farmaci e File F (€/000 610). Tali incrementi sono stati parzialmente compensati dalla riduzione dei costi per acquisti di servizi sanitari per assistenza ambulatoriale (per €/000 - 459).  In merito alla mobilità sanitaria extra regionale va precisato, ad ogni buon conto, che essa, ai sensi del D. Lgs. 118/2011, viene contabilizzata con due anni di ritardo rispetto all'esercizio di competenza e, come stabilisce il citato decreto, la rilevazione contabile viene effettuata al netto degli eventuali conguagli (+ o -) dei due esercizi precedenti. "]

{"sheet":"Tab 58 bis","index":14,"n_rows":79,"n_cols":5,"rows_kept":79,"cut":false,"hidden":false,"merged":[[25,4,26,4],[51,4,56,4],[65,4,69,4],[78,0,78,1],[27,4,31,4],[42,4,46,4],[47,4,50,4],[57,4,64,4],[32,4,37,4],[78,4,78,5],[38,4,41,4],[23,4,24,4],[0,0,0,4],[3,4,6,4],[7,4,10,4],[11,4,17,4],[18,4,22,4]]}
["Tab. 58 bis - Tabella di raccordo - DETTAGLIO ACQUISTI DI SERVIZI SANITARI IN MOBILITA'"]
[]
["Voce CE","Descrizione",null,"Importo","Voce CE D.Lgs. 118/2011 "]
["BA0410","B.2.A.1)   Acquisti servizi sanitari per medicina di base",null,{"$f":"SUM(D5:D7)","v":35909283.82},"B 2) a)"]
["BA0420","B.2.A.1.1) - da convenzione",null,{"$f":"SUMIF('00 CE'!B:B,'Tab 58 bis'!A5,'00 CE'!G:G)","v":35653505.32}]
["BA0470","B.2.A.1.2) - da pubblico (Aziende sanitarie pubbliche della Regione) - Mobilità intraregionale","a",{"$f":"SUMIF('00 CE'!B:B,'Tab 58 bis'!A6,'00 CE'!G:G)","v":38671}]
["BA0480","B.2.A.1.3) - da pubblico (Aziende sanitarie pubbliche Extraregione) - Mobilità extraregionale","b",{"$f":"SUMIF('00 CE'!B:B,'Tab 58 bis'!A7,'00 CE'!G:G)","v":217107.5}]
["BA0490","B.2.A.2)   Acquisti servizi sanitari per farmaceutica",null,{"$f":"SUM(D9:D11)","v":51864361.029999994},"B 2) b)"]
["BA0500","B.2.A.2.1) - da convenzione",null,{"$f":"SUMIF('00 CE'!B:B,'Tab 58 bis'!A9,'00 CE'!G:G)","v":50129678.229999997}]
["BA0510","B.2.A.2.2) - da pubblico (Aziende sanitarie pubbliche della Regione)- Mobilità intraregionale","a",{"$f":"SUMIF('00 CE'!B:B,'Tab 58 bis'!A10,'00 CE'!G:G)","v":1277628.07}]
["BA0520","B.2.A.2.3) - da pubblico (Extraregione)","b",{"$f":"SUMIF('00 CE'!B:B,'Tab 58 bis'!A11,'00 CE'!G:G)","v":457054.73}]
["BA0530","B.2.A.3)   Acquisti servizi sanitari per assistenza specialistica ambulatoriale",null,{"$f":"SUM(D13:D18)","v":26809571.489999998},"B 2) c)"]
["BA0540","B.2.A.3.1) - da pubblico (Aziende sanitarie pubbliche della Regione)","a",{"$f":"SUMIF('00 CE'!B:B,'Tab 58 bis'!A13,'00 CE'!G:G)","v":8879359.5700000003}]
["BA0550","B.2.A.3.2) - da pubblico (altri soggetti pubbl. della Regione)",null,{"$f":"SUMIF('00 CE'!B:B,'Tab 58 bis'!A14,'00 CE'!G:G)","v":360209.89}]
["BA0560","B.2.A.3.3) - da pubblico (Extraregione)","b",{"$f":"SUMIF('00 CE'!B:B,'Tab 58 bis'!A15,'00 CE'!G:G)","v":4000753.58}]
["BA0570","B.2.A.3.4) - da privato - Medici SUMAI",null,{"$f":"SUMIF('00 CE'!B:B,'Tab 58 bis'!A16,'00 CE'!G:G)","v":4486744.21}]
["BA0580","B.2.A.3.5) - da privato",null,{"$f":"SUMIF('00 CE'!B:B,'Tab 58 bis'!A17,'00 CE'!G:G)","v":8885806.0099999998}]
["BA0630","B.2.A.3.6) - da privato per cittadini non residenti - Extraregione (mobilità attiva in compensazione)",null,{"$f":"SUMIF('00 CE'!B:B,'Tab 58 bis'!A18,'00 CE'!G:G)","v":196698.22999999998}]
["BA0640","B.2.A.4)   Acquisti servizi sanitari per assistenza riabilitativa",null,{"$f":"SUM(D20:D23)","v":19990902.559999999},"B 2) d)"]
["BA0650","B.2.A.4.1) - da pubblico (Aziende sanitarie pubbliche della Regione)","a",{"$f":"SUMIF('00 CE'!B:B,'Tab 58 bis'!A20,'00 CE'!G:G)","v":4832965.95}]
["BA0670","B.2.A.4.3) - da pubblico (Extraregione) non soggetti a compensazione",null,{"$f":"SUMIF('00 CE'!B:B,'Tab 58 bis'!A21,'00 CE'!G:G)","v":0}]
["BA0680","B.2.A.4.4) - da privato (intraregionale)",null,{"$f":"SUMIF('00 CE'!B:B,'Tab 58 bis'!A22,'00 CE'!G:G)","v":14612451.73}]
["BA0690","B.2.A.4.5) - da privato (extraregionale)",null,{"$f":"SUMIF('00 CE'!B:B,'Tab 58 bis'!A23,'00 CE'!G:G)","v":545484.88}]
["BA0700","B.2.A.5)   Acquisti servizi sanitari per assistenza integrativa",null,{"$f":"SUM(D25:D25)","v":1802068.84},"B 2) e)"]
["BA0740","B.2.A.5.4) - da privato",null,{"$f":"SUMIF('00 CE'!B:B,'Tab 58 bis'!A25,'00 CE'!G:G)","v":1802068.84}]
["BA0750","B.2.A.6)   Acquisti servizi sanitari per assistenza protesica",null,{"$f":"SUM(D27)","v":6303229.0099999998},"B 2) f)"]
["BA0790","B.2.A.6.4) - da privato",null,{"$f":"SUMIF('00 CE'!B:B,'Tab 58 bis'!A27,'00 CE'!G:G)","v":6303229.0099999998}]
["BA0800","B.2.A.7)   Acquisti servizi sanitari per assistenza ospedaliera",null,{"$f":"SUM(D29:D32)","v":123489437.36999999},"B 2) g)"]
["BA0810","B.2.A.7.1) - da pubblico (Aziende sanitarie pubbliche della Regione)","a",{"$f":"SUMIF('00 CE'!B:B,'Tab 58 bis'!A29,'00 CE'!G:G)","v":26481532.390000001}]
["BA0830","B.2.A.7.3) - da pubblico (Extraregione)","b",{"$f":"SUMIF('00 CE'!B:B,'Tab 58 bis'!A30,'00 CE'!G:G)","v":24057993.460000001}]
["BA0840","B.2.A.7.4) - da privato",null,{"$f":"SUMIF('00 CE'!B:B,'Tab 58 bis'!A31,'00 CE'!G:G)","v":62664028.379999995}]
["BA0890","B.2.A.7.5) - da privato per cittadini non residenti - Extraregione (mobilità attiva in compensazione)",null,{"$f":"SUMIF('00 CE'!B:B,'Tab 58 bis'!A32,'00 CE'!G:G)","v":10285883.140000001}]
["BA0900","B.2.A.8)   Acquisto prestazioni di psichiatria residenziale e semiresidenziale",null,{"$f":"SUM(D34:D38)","v":13021762.400000002},"B 2) h)"]
["BA0910","B.2.A.8.1) - da pubblico (Aziende sanitarie pubbliche della Regione)","a",{"$f":"SUMIF('00 CE'!B:B,'Tab 58 bis'!A34,'00 CE'!G:G)","v":1551575.5}]
["BA0920","B.2.A.8.2) - da pubblico (altri soggetti pubbl. della Regione)",null,{"$f":"SUMIF('00 CE'!B:B,'Tab 58 bis'!A35,'00 CE'!G:G)","v":0}]
["BA0930","B.2.A.8.3) - da pubblico (Extraregione) - non soggette a compensazione",null,{"$f":"SUMIF('00 CE'!B:B,'Tab 58 bis'!A36,'00 CE'!G:G)","v":81781.600000000006}]
["BA0940","B.2.A.8.4) - da privato (intraregionale)",null,{"$f":"SUMIF('00 CE'!B:B,'Tab 58 bis'!A37,'00 CE'!G:G)","v":9798519.8400000017}]
["BA0950","B.2.A.8.5) - da privato (extraregionale)",null,{"$f":"SUMIF('00 CE'!B:B,'Tab 58 bis'!A38,'00 CE'!G:G)","v":1589885.46}]
["BA0960","B.2.A.9)   Acquisto prestazioni di distribuzione farmaci File F",null,{"$f":"SUM(D40:D42)","v":7092976.6900000004},"B 2) i)"]
["BA0970","B.2.A.9.1) - da pubblico (Aziende sanitarie pubbliche della Regione) - Mobilità intraregionale","a",{"$f":"SUMIF('00 CE'!B:B,'Tab 58 bis'!A40,'00 CE'!G:G)","v":4464112.37}]
["BA0990","B.2.A.9.3) - da pubblico (Extraregione)","b",{"$f":"SUMIF('00 CE'!B:B,'Tab 58 bis'!A41,'00 CE'!G:G)","v":2195879.04}]
["BA1000","B.2.A.9.4) - da privato (intraregionale)",null,{"$f":"SUMIF('00 CE'!B:B,'Tab 58 bis'!A42,'00 CE'!G:G)","v":432985.28}]
["BA1030","B.2.A.10)   Acquisto prestazioni termali in convenzione",null,{"$f":"SUM(D44:D47)","v":2149505.71},"B 2) j)"]
["BA1040","B.2.A.10.1) - da pubblico (Aziende sanitarie pubbliche della Regione) - Mobilità intraregionale","a",{"$f":"SUMIF('00 CE'!B:B,'Tab 58 bis'!A44,'00 CE'!G:G)","v":0}]
["BA1060","B.2.A.10.3) - da pubblico (Extraregione)","b",{"$f":"SUMIF('00 CE'!B:B,'Tab 58 bis'!A45,'00 CE'!G:G)","v":95302.31}]
["BA1070","B.2.A.10.4) - da privato",null,{"$f":"SUMIF('00 CE'!B:B,'Tab 58 bis'!A46,'00 CE'!G:G)","v":1821580.51}]
["BA1080","B.2.A.10.5) - da privato per cittadini non residenti - Extraregione (mobilità attiva in compensazione)",null,{"$f":"SUMIF('00 CE'!B:B,'Tab 58 bis'!A47,'00 CE'!G:G)","v":232622.88999999998}]
["BA1090","B.2.A.11)   Acquisto prestazioni di trasporto sanitario",null,{"$f":"SUM(D49:D51)","v":8783342.459999999},"B 2) k)"]
["BA1100","B.2.A.11.1) - da pubblico (Aziende sanitarie pubbliche della Regione) - Mobilità intraregionale","a",{"$f":"SUMIF('00 CE'!B:B,'Tab 58 bis'!A49,'00 CE'!G:G)","v":103216}]
["BA1120","B.2.A.11.3) - da pubblico (Extraregione)","b",{"$f":"SUMIF('00 CE'!B:B,'Tab 58 bis'!A50,'00 CE'!G:G)","v":344124.9}]
["BA1130","B.2.A.11.4) - da privato",null,{"$f":"SUMIF('00 CE'!B:B,'Tab 58 bis'!A51,'00 CE'!G:G)","v":8336001.5599999996}]
["BA1140","B.2.A.12)   Acquisto prestazioni Socio-Sanitarie a rilevanza sanitaria",null,{"$f":"SUM(D53:D57)","v":16307538.569999998},"B 2) l)"]
["BA1150","B.2.A.12.1) - da pubblico (Aziende sanitarie pubbliche della Regione) - Mobilità intraregionale","a",{"$f":"SUMIF('00 CE'!B:B,'Tab 58 bis'!A53,'00 CE'!G:G)","v":1758520.3800000001}]
["BA1160","B.2.A.12.2) - da pubblico (altri soggetti pubblici della Regione)",null,{"$f":"SUMIF('00 CE'!B:B,'Tab 58 bis'!A54,'00 CE'!G:G)","v":0}]
["BA1170","B.2.A.12.3) - da pubblico (Extraregione) non soggette a compensazione",null,{"$f":"SUMIF('00 CE'!B:B,'Tab 58 bis'!A55,'00 CE'!G:G)","v":160969.38}]
["BA1180","B.2.A.12.4) - da privato (intraregionale)",null,{"$f":"SUMIF('00 CE'!B:B,'Tab 58 bis'!A56,'00 CE'!G:G)","v":12500635.899999999}]
["BA1190","B.2.A.12.5) - da privato (extraregionale)",null,{"$f":"SUMIF('00 CE'!B:B,'Tab 58 bis'!A57,'00 CE'!G:G)","v":1887412.9100000001}]
["BA1200","B.2.A.13)  Compartecipazione al personale per att. libero-prof. (intramoenia)",null,{"$f":"SUM(D59:D65)","v":3321031.3200000003},"B 2) m)"]
["BA1210","B.2.A.13.1)  Compartecipazione al personale per att. libero professionale intramoenia - Area ospedaliera",null,{"$f":"SUMIF('00 CE'!B:B,'Tab 58 bis'!A59,'00 CE'!G:G)","v":54218.100000000006}]
["BA1220","B.2.A.13.2)  Compartecipazione al personale per att. libero professionale intramoenia- Area specialistica",null,{"$f":"SUMIF('00 CE'!B:B,'Tab 58 bis'!A60,'00 CE'!G:G)","v":2563747.4700000002}]
["BA1230","B.2.A.13.3)  Compartecipazione al personale per att. libero professionale intramoenia - Area sanità pubblica",null,{"$f":"SUMIF('00 CE'!B:B,'Tab 58 bis'!A61,'00 CE'!G:G)","v":15233.61}]
["BA1240","B.2.A.13.4)  Compartecipazione al personale per att. libero professionale intramoenia - Consulenze (ex art. 55 c.1 lett. c), d) ed ex Art. 57-58)",null,{"$f":"SUMIF('00 CE'!B:B,'Tab 58 bis'!A62,'00 CE'!G:G)","v":579327.30000000005}]
["BA1250","B.2.A.13.5)  Compartecipazione al personale per att. libero professionale intramoenia - Consulenze (ex art. 55 c.1 lett. c), d) ed ex Art. 57-58) (Aziende sanitarie pubbliche della Regione)",null,{"$f":"SUMIF('00 CE'!B:B,'Tab 58 bis'!A63,'00 CE'!G:G)","v":0}]
["BA1260","B.2.A.13.6)  Compartecipazione al personale per att. libero professionale intramoenia - Altro",null,{"$f":"SUMIF('00 CE'!B:B,'Tab 58 bis'!A64,'00 CE'!G:G)","v":108504.84}]
["BA1270","B.2.A.13.7)  Compartecipazione al personale per att. libero  professionale intramoenia - Altro (Aziende sanitarie pubbliche della Regione)",null,{"$f":"SUMIF('00 CE'!B:B,'Tab 58 bis'!A65,'00 CE'!G:G)","v":0}]
["BA1280","B.2.A.14)  Rimborsi, assegni e contributi sanitari",null,{"$f":"SUM(D67:D70)","v":2143960.7800000003},"B 2) n)"]
["BA1290","B.2.A.14.1)  Contributi ad associazioni di volontariato",null,{"$f":"SUMIF('00 CE'!B:B,'Tab 58 bis'!A67,'00 CE'!G:G)","v":349365.76000000001}]
["BA1300","B.2.A.14.2)  Rimborsi per cure all'estero",null,{"$f":"SUMIF('00 CE'!B:B,'Tab 58 bis'!A68,'00 CE'!G:G)","v":2069.39}]
["BA1330","B.2.A.14.5)  Altri rimborsi, assegni e contributi",null,{"$f":"SUMIF('00 CE'!B:B,'Tab 58 bis'!A69,'00 CE'!G:G)","v":1792525.6300000001}]
["BA1340","B.2.A.14.6)  Rimborsi, assegni e contributi v/Aziende sanitarie pubbliche della Regione",null,{"$f":"SUMIF('00 CE'!B:B,'Tab 58 bis'!A70,'00 CE'!G:G)","v":0}]
["BA1350","B.2.A.15)  Consulenze, Collaborazioni,  Interinale e altre prestazioni di lavoro sanitarie e sociosanitarie",null,{"$f":"SUMIF('00 CE'!B:B,'Tab 58 bis'!A71,'00 CE'!G:G)","v":6574839.0399999991},"B 2) o)"]
["BA1490","B.2.A.16) Altri servizi sanitari e sociosanitari a rilevanza sanitaria",null,{"$f":"SUMIF('00 CE'!B:B,'Tab 58 bis'!A72,'00 CE'!G:G)","v":5607016.7799999993},"B 2) p)"]
[]
["BA0400","Totale Acquisti servizi sanitari",null,{"$f":"D4+D8+D12+D19+D24+D26+D28+D33+D39+D43+D48+D52+D58+D66+D71+D72","v":331170827.86999983},"B.2"]
[]
["Somma a","Costi da mobilità sanitaria infraregionale",null,{"$f":"D6+D10+D13+D20+D29+D34+D40+D44+D49+D53","v":49387581.230000004}]
["Somma b","Costi da mobilità sanitaria extraregionale",null,{"$f":"D7+D11+D15+D30+D41+D45+D50","v":31368215.52}]
[]
["TOTALE COSTI DA MOBILITA' SANITARIA",null,null,{"$f":"D76+D77","v":80755796.75},"in accordo con Tabella n. 58 "]

{"sheet":"Tab 59-60","index":15,"n_rows":116,"n_cols":6,"rows_kept":116,"cut":false,"hidden":false,"merged":[[72,1,72,5],[73,0,74,0],[73,1,74,1],[73,2,74,2],[73,3,74,3],[73,4,74,4],[73,5,74,5],[0,1,0,5],[1,0,2,0],[1,1,2,1],[1,2,2,2],[1,3,2,3],[1,4,2,4],[1,5,2,5]]}
[null,"Tab. 59 – Dettaglio acquisti di servizi sanitari – I parte"]
["CODICE MOD. CE","DETTAGLIO ACQUISTI DI SERVIZI SANITARI",{"$f":"\"Valore CE \" &'00 Aggregatore'!$F$2","v":"Valore CE 2018"},{"$f":"\"Valore CE \" &'00 Aggregatore'!$F$2 -1","v":"Valore CE 2017"},"Variazioni\nimporto","Variazioni\n%"]
[]
[null,"ACQUISTI DI SERVIZI SANITARI - MEDICINA DI BASE",{"$f":"C5+C10+C11","v":35909283.82},{"$f":"D5+D10+D11","v":35655655.119999997},{"$f":"C4-D4","v":253628.70000000298},{"$f":"IF(AND(C4=0,D4=0),0,IF(C4=0,\"\",IF(D4=0,\"\",E4/D4)))","v":7.1132811652572158E-3}]
["BA0420","- da convenzione",{"$f":"SUMIF('00 CE'!$B:$B,$A5,'00 CE'!G:G)","v":35653505.32},{"$f":"SUMIF('00 CE'!$B:$B,$A5,'00 CE'!F:F)","v":35435849.350000001},{"$f":"C5-D5","v":217655.96999999881},{"$f":"IF(AND(C5=0,D5=0),0,IF(C5=0,\"\",IF(D5=0,\"\",E5/D5)))","v":6.14225350859267E-3}]
["BA0430","Costi per assistenza MMG",{"$f":"SUMIF('00 CE'!$B:$B,$A6,'00 CE'!G:G)","v":24517314.75},{"$f":"SUMIF('00 CE'!$B:$B,$A6,'00 CE'!F:F)","v":24328709.329999998},{"$f":"C6-D6","v":188605.42000000179},7.7523808370479558E-3]
["BA0440","Costi per assistenza PLS",{"$f":"SUMIF('00 CE'!$B:$B,$A7,'00 CE'!G:G)","v":6415070.5300000003},{"$f":"SUMIF('00 CE'!$B:$B,$A7,'00 CE'!F:F)","v":6208374.4000000004},206696.12999999989,3.3293116149696107E-2]
["BA0450","Costi per assistenza Continuità assistenziale",{"$f":"SUMIF('00 CE'!$B:$B,$A8,'00 CE'!G:G)","v":3931463.93},{"$f":"SUMIF('00 CE'!$B:$B,$A8,'00 CE'!F:F)","v":4008916.53},-77452.599999999627,-1.9320082975137331E-2]
["BA0460","Altro (medicina dei servizi, psicologi, medici 118, ecc)",{"$f":"SUMIF('00 CE'!$B:$B,$A9,'00 CE'!G:G)","v":789656.11},{"$f":"SUMIF('00 CE'!$B:$B,$A9,'00 CE'!F:F)","v":889849.09},-100192.97999999998,-0.11259547391344749]
["BA0470","- da pubblico (Aziende sanitarie pubbliche della Regione) - Mobilità intraregionale",{"$f":"SUMIF('00 CE'!$B:$B,$A10,'00 CE'!G:G)","v":38671},{"$f":"SUMIF('00 CE'!$B:$B,$A10,'00 CE'!F:F)","v":35057.19},3613.8099999999977,0.10308327621238318]
["BA0480","- da pubblico (Aziende sanitarie pubbliche Extraregione) - Mobilità extraregionale",{"$f":"SUMIF('00 CE'!$B:$B,$A11,'00 CE'!G:G)","v":217107.5},{"$f":"SUMIF('00 CE'!$B:$B,$A11,'00 CE'!F:F)","v":184748.58},32358.920000000013,0.17515111618178617]
[null,"ACQUISTI DI SERVIZI SANITARI - FARMACEUTICA",{"$f":"SUM(C13:C15)","v":51864361.029999994},{"$f":"SUM(D13:D15)","v":54563948.050000004},{"$f":"SUM(E13:E15)","v":-2699587.0200000065},-4.9475654099043996E-2]
["BA0500","- da convenzione",{"$f":"SUMIF('00 CE'!$B:$B,$A13,'00 CE'!G:G)","v":50129678.229999997},{"$f":"SUMIF('00 CE'!$B:$B,$A13,'00 CE'!F:F)","v":52924145.520000003},{"$f":"C13-D13","v":-2794467.2900000066},-5.2801368119282703E-2]
["BA0510","- da pubblico (Aziende sanitarie pubbliche della Regione)- Mobilità intraregionale",{"$f":"SUMIF('00 CE'!$B:$B,$A14,'00 CE'!G:G)","v":1277628.07},{"$f":"SUMIF('00 CE'!$B:$B,$A14,'00 CE'!F:F)","v":1251970.51},{"$f":"C14-D14","v":25657.560000000056},2.0493741501946446E-2]
["BA0520","- da pubblico (Extraregione)",{"$f":"SUMIF('00 CE'!$B:$B,$A15,'00 CE'!G:G)","v":457054.73},{"$f":"SUMIF('00 CE'!$B:$B,$A15,'00 CE'!F:F)","v":387832.02},{"$f":"C15-D15","v":69222.709999999963},0.17848631992789032]
[null,"ACQUISTI DI SERVIZI SANITARI PER ASSITENZA SPECIALISTICA AMBULATORIALE",{"$f":"C17+C18+C19+C20+C21+C26","v":26809571.489999998},{"$f":"D17+D18+D19+D20+D21+D26","v":27519184.069999997},{"$f":"C16-D16","v":-709612.57999999821},-2.5786105365441465E-2]
["BA0540","- da pubblico (Aziende sanitarie pubbliche della Regione)",{"$f":"SUMIF('00 CE'!$B:$B,$A17,'00 CE'!G:G)","v":8879359.5700000003},{"$f":"SUMIF('00 CE'!$B:$B,$A17,'00 CE'!F:F)","v":8998122.1099999994},-118762.53999999911,-1.3198591722601008E-2]
["BA0550","- da pubblico (altri soggetti pubbl. della Regione)",{"$f":"SUMIF('00 CE'!$B:$B,$A18,'00 CE'!G:G)","v":360209.89},{"$f":"SUMIF('00 CE'!$B:$B,$A18,'00 CE'!F:F)","v":189344.67},170865.22,0.90240311491208069]
["BA0560","- da pubblico (Extraregione)",{"$f":"SUMIF('00 CE'!$B:$B,$A19,'00 CE'!G:G)","v":4000753.58},{"$f":"SUMIF('00 CE'!$B:$B,$A19,'00 CE'!F:F)","v":4460024.9400000004},-459271.36000000034,-0.10297506542642793]
["BA0570","- da privato - Medici SUMAI",{"$f":"SUMIF('00 CE'!$B:$B,$A20,'00 CE'!G:G)","v":4486744.21},{"$f":"SUMIF('00 CE'!$B:$B,$A20,'00 CE'!F:F)","v":4899151.05},-412406.83999999985,-8.4179245708294673E-2]
["BA0580","- da privato",{"$f":"SUMIF('00 CE'!$B:$B,$A21,'00 CE'!G:G)","v":8885806.0099999998},{"$f":"SUMIF('00 CE'!$B:$B,$A21,'00 CE'!F:F)","v":8757843.0999999996},127962.91000000015,1.4611235727664516E-2]
["BA0590","Servizi sanitari per assistenza specialistica da IRCCS privati e Policlinici privati",{"$f":"SUMIF('00 CE'!$B:$B,$A22,'00 CE'!G:G)","v":83336.34},{"$f":"SUMIF('00 CE'!$B:$B,$A22,'00 CE'!F:F)","v":60978.73},22357.609999999993,0.36664604198873924]
["BA0600","Servizi sanitari per assistenza specialistica da Ospedali Classificati privati",{"$f":"SUMIF('00 CE'!$B:$B,$A23,'00 CE'!G:G)","v":0},{"$f":"SUMIF('00 CE'!$B:$B,$A23,'00 CE'!F:F)","v":0},0,0]
["BA0610","Servizi sanitari per assistenza specialistica da Case di Cura private",{"$f":"SUMIF('00 CE'!$B:$B,$A24,'00 CE'!G:G)","v":5463686.8200000003},{"$f":"SUMIF('00 CE'!$B:$B,$A24,'00 CE'!F:F)","v":5412858.8699999992},50827.950000001118,9.3902226569600403E-3]
["BA0620","Servizi sanitari per assistenza specialistica da altri privati",{"$f":"SUMIF('00 CE'!$B:$B,$A25,'00 CE'!G:G)","v":3338782.85},{"$f":"SUMIF('00 CE'!$B:$B,$A25,'00 CE'!F:F)","v":3284005.5},54777.350000000093,1.6680042101025742E-2]
["BA0630","- da privato per cittadini non residenti - Extraregione (mobilità attiva in compensazione)",{"$f":"SUMIF('00 CE'!$B:$B,$A26,'00 CE'!G:G)","v":196698.22999999998},{"$f":"SUMIF('00 CE'!$B:$B,$A26,'00 CE'!F:F)","v":214698.2},-17999.97000000003,-8.3838476521927191E-2]
[null,"ACQUISTI DI SERVIZI SANITARI PER ASSISTENZA RIABILITATIVA",{"$f":"SUM(C28:C32)","v":19990902.559999999},{"$f":"SUM(D28:D32)","v":19907207.98},83694.579999998212,4.2042349727838737E-3]
["BA0650","- da pubblico (Aziende sanitarie pubbliche della Regione)",{"$f":"SUMIF('00 CE'!$B:$B,$A28,'00 CE'!G:G)","v":4832965.95},{"$f":"SUMIF('00 CE'!$B:$B,$A28,'00 CE'!F:F)","v":4855060.17},-22094.219999999739,-4.5507613142515887E-3]
["BA0660","- da pubblico (altri soggetti pubbl. della Regione)",{"$f":"SUMIF('00 CE'!$B:$B,$A29,'00 CE'!G:G)","v":0},{"$f":"SUMIF('00 CE'!$B:$B,$A29,'00 CE'!F:F)","v":0},0,0]
["BA0670","- da pubblico (Extraregione) non soggetti a compensazione",{"$f":"SUMIF('00 CE'!$B:$B,$A30,'00 CE'!G:G)","v":0},{"$f":"SUMIF('00 CE'!$B:$B,$A30,'00 CE'!F:F)","v":0},0,0]
["BA0680","- da privato (intraregionale)",{"$f":"SUMIF('00 CE'!$B:$B,$A31,'00 CE'!G:G)","v":14612451.73},{"$f":"SUMIF('00 CE'!$B:$B,$A31,'00 CE'!F:F)","v":14460769.459999999},151682.27000000142,1.0489225377637783E-2]
["BA0690","- da privato (extraregionale)",{"$f":"SUMIF('00 CE'!$B:$B,$A32,'00 CE'!G:G)","v":545484.88},{"$f":"SUMIF('00 CE'!$B:$B,$A32,'00 CE'!F:F)","v":591378.35},-45893.469999999972,-7.7604244389399737E-2]
[null,"ACQUISTI DI SERVIZI SANITARI PER ASSISTENZA INTEGRATIVA",{"$f":"SUM(C34:C37)","v":1802068.84},{"$f":"SUM(D34:D37)","v":1813040.82},-10971.979999999981,-6.0517004796394941E-3]
["BA0710","- da pubblico (Aziende sanitarie pubbliche della Regione)",{"$f":"SUMIF('00 CE'!$B:$B,$A34,'00 CE'!G:G)","v":0},{"$f":"SUMIF('00 CE'!$B:$B,$A34,'00 CE'!F:F)","v":0},0,0]
["BA0720","- da pubblico (altri soggetti pubbl. della Regione)",{"$f":"SUMIF('00 CE'!$B:$B,$A35,'00 CE'!G:G)","v":0},{"$f":"SUMIF('00 CE'!$B:$B,$A35,'00 CE'!F:F)","v":0},0,0]
["BA0730","- da pubblico (Extraregione)",{"$f":"SUMIF('00 CE'!$B:$B,$A36,'00 CE'!G:G)","v":0},{"$f":"SUMIF('00 CE'!$B:$B,$A36,'00 CE'!F:F)","v":0},0,0]
["BA0740","- da privato",{"$f":"SUMIF('00 CE'!$B:$B,$A37,'00 CE'!G:G)","v":1802068.84},{"$f":"SUMIF('00 CE'!$B:$B,$A37,'00 CE'!F:F)","v":1813040.82},-10971.979999999981,-6.0517004796394941E-3]
[null,"ACQUISTI DI SERVIZI SANITARI PER ASSISTENZA PROTESICA",{"$f":"SUM(C39:C42)","v":6303229.0099999998},{"$f":"SUM(D39:D42)","v":6384295.54},-81066.530000000261,-1.2697803460395609E-2]
["BA0760","- da pubblico (Aziende sanitarie pubbliche della Regione)",{"$f":"SUMIF('00 CE'!$B:$B,$A39,'00 CE'!G:G)","v":0},{"$f":"SUMIF('00 CE'!$B:$B,$A39,'00 CE'!F:F)","v":0},0,0]
["BA0770","- da pubblico (altri soggetti pubbl. della Regione)",{"$f":"SUMIF('00 CE'!$B:$B,$A40,'00 CE'!G:G)","v":0},{"$f":"SUMIF('00 CE'!$B:$B,$A40,'00 CE'!F:F)","v":0},0,0]
["BA0780","- da pubblico (Extraregione)",{"$f":"SUMIF('00 CE'!$B:$B,$A41,'00 CE'!G:G)","v":0},{"$f":"SUMIF('00 CE'!$B:$B,$A41,'00 CE'!F:F)","v":0},0,0]
["BA0790","- da privato",{"$f":"SUMIF('00 CE'!$B:$B,$A42,'00 CE'!G:G)","v":6303229.0099999998},{"$f":"SUMIF('00 CE'!$B:$B,$A42,'00 CE'!F:F)","v":6384295.54},-81066.530000000261,-1.2697803460395609E-2]
[null,"ACQUISTI DI SERVIZI SANITARI PER ASSISTENZA OSPEDALIERA",{"$f":"C44+C45+C46+C47+C52","v":123489437.36999999},{"$f":"D44+D45+D46+D47+D52","v":125006439.52000001},-1517002.1500000209,-1.2135392031202624E-2]
["BA0810","- da pubblico (Aziende sanitarie pubbliche della Regione)",{"$f":"SUMIF('00 CE'!$B:$B,$A44,'00 CE'!G:G)","v":26481532.390000001},{"$f":"SUMIF('00 CE'!$B:$B,$A44,'00 CE'!F:F)","v":28230091.68},-1748559.2899999991,-6.1939554069489269E-2]
["BA0820","- da pubblico (altri soggetti pubbl. della Regione)",{"$f":"SUMIF('00 CE'!$B:$B,$A45,'00 CE'!G:G)","v":0},{"$f":"SUMIF('00 CE'!$B:$B,$A45,'00 CE'!F:F)","v":0},0,0]
["BA0830","- da pubblico (Extraregione)",{"$f":"SUMIF('00 CE'!$B:$B,$A46,'00 CE'!G:G)","v":24057993.460000001},{"$f":"SUMIF('00 CE'!$B:$B,$A46,'00 CE'!F:F)","v":23048879.050000001},1009114.4100000001,4.3781496176491935E-2]
["BA0840","- da privato",{"$f":"SUMIF('00 CE'!$B:$B,$A47,'00 CE'!G:G)","v":62664028.379999995},{"$f":"SUMIF('00 CE'!$B:$B,$A47,'00 CE'!F:F)","v":61809764.719999999},854263.65999999642,1.3820852803272027E-2]
["BA0850","Servizi sanitari per assistenza ospedaliera da IRCCS privati e Policlinici privati",{"$f":"SUMIF('00 CE'!$B:$B,$A48,'00 CE'!G:G)","v":0},{"$f":"SUMIF('00 CE'!$B:$B,$A48,'00 CE'!F:F)","v":0},0,0]
["BA0860","Servizi sanitari per assistenza ospedaliera da Ospedali Classificati privati",{"$f":"SUMIF('00 CE'!$B:$B,$A49,'00 CE'!G:G)","v":0},{"$f":"SUMIF('00 CE'!$B:$B,$A49,'00 CE'!F:F)","v":0},0,0]
["BA0870","Servizi sanitari per assistenza ospedaliera da Case di Cura private",{"$f":"SUMIF('00 CE'!$B:$B,$A50,'00 CE'!G:G)","v":62664028.379999995},{"$f":"SUMIF('00 CE'!$B:$B,$A50,'00 CE'!F:F)","v":61809764.719999999},854263.65999999642,1.3820852803272027E-2]
["BA0880","Servizi sanitari per assistenza ospedaliera da altri privati",{"$f":"SUMIF('00 CE'!$B:$B,$A51,'00 CE'!G:G)","v":0},{"$f":"SUMIF('00 CE'!$B:$B,$A51,'00 CE'!F:F)","v":0},0,0]
["BA0890","- da privato per cittadini non residenti - Extraregione (mobilità attiva in compensazione)",{"$f":"SUMIF('00 CE'!$B:$B,$A52,'00 CE'!G:G)","v":10285883.140000001},{"$f":"SUMIF('00 CE'!$B:$B,$A52,'00 CE'!F:F)","v":11917704.07},-1631820.9299999997,-0.13692410219412335]
[null,"ACQUISTI PRESTAZIONI DI PSICHIATRICA RESIDENZIALE E SEMIRESIDENZIALE",{"$f":"SUM(C54:C58)","v":13021762.400000002},{"$f":"SUM(D54:D58)","v":13199111.060000001},-177348.65999999829,-1.3436409406195138E-2]
["BA0910","- da pubblico (Aziende sanitarie pubbliche della Regione)",{"$f":"SUMIF('00 CE'!$B:$B,$A54,'00 CE'!G:G)","v":1551575.5},{"$f":"SUMIF('00 CE'!$B:$B,$A54,'00 CE'!F:F)","v":1648164.66},-96589.159999999916,-5.8604071755791631E-2]
["BA0920","- da pubblico (altri soggetti pubbl. della Regione)",{"$f":"SUMIF('00 CE'!$B:$B,$A55,'00 CE'!G:G)","v":0},{"$f":"SUMIF('00 CE'!$B:$B,$A55,'00 CE'!F:F)","v":0},0,0]
["BA0930","- da pubblico (Extraregione) - non soggette a compensazione",{"$f":"SUMIF('00 CE'!$B:$B,$A56,'00 CE'!G:G)","v":81781.600000000006},{"$f":"SUMIF('00 CE'!$B:$B,$A56,'00 CE'!F:F)","v":6667},75114.600000000006,11.266626668666568]
["BA0940","- da privato (intraregionale)",{"$f":"SUMIF('00 CE'!$B:$B,$A57,'00 CE'!G:G)","v":9798519.8400000017},{"$f":"SUMIF('00 CE'!$B:$B,$A57,'00 CE'!F:F)","v":9671880.5899999999},126639.25000000186,1.3093549782959207E-2]
["BA0950","- da privato (extraregionale)",{"$f":"SUMIF('00 CE'!$B:$B,$A58,'00 CE'!G:G)","v":1589885.46},{"$f":"SUMIF('00 CE'!$B:$B,$A58,'00 CE'!F:F)","v":1872398.81},-282513.35000000009,-0.15088310700218832]
[null,"ACQUISTI PRESTAZIONI DI DISTRIBUZIONE FARMACI FILE F",{"$f":"SUM(C60:C65)","v":7092976.6900000004},{"$f":"SUM(D60:D65)","v":5976832.0300000003},1116144.6600000001,0.18674519451067795]
["BA0970","- da pubblico (Aziende sanitarie pubbliche della Regione) - Mobilità intraregionale",{"$f":"SUMIF('00 CE'!$B:$B,$A60,'00 CE'!G:G)","v":4464112.37},{"$f":"SUMIF('00 CE'!$B:$B,$A60,'00 CE'!F:F)","v":4391409.7},72702.669999999925,1.6555656376129043E-2]
["BA0980","- da pubblico (altri soggetti pubbl. della Regione)",{"$f":"SUMIF('00 CE'!$B:$B,$A61,'00 CE'!G:G)","v":0},{"$f":"SUMIF('00 CE'!$B:$B,$A61,'00 CE'!F:F)","v":0},0,0]
["BA0990","- da pubblico (Extraregione)",{"$f":"SUMIF('00 CE'!$B:$B,$A62,'00 CE'!G:G)","v":2195879.04},{"$f":"SUMIF('00 CE'!$B:$B,$A62,'00 CE'!F:F)","v":1585422.33},610456.71,0.38504359276937894]
["BA1000","- da privato (intraregionale)",{"$f":"SUMIF('00 CE'!$B:$B,$A63,'00 CE'!G:G)","v":432985.28},{"$f":"SUMIF('00 CE'!$B:$B,$A63,'00 CE'!F:F)","v":0},432985.28,""]
["BA1010","- da privato (extraregionale)",{"$f":"SUMIF('00 CE'!$B:$B,$A64,'00 CE'!G:G)","v":0},{"$f":"SUMIF('00 CE'!$B:$B,$A64,'00 CE'!F:F)","v":0},0,0]
["BA1020","- da privato per cittadini non residenti - Extraregione (mobilità attiva in compensazione)",{"$f":"SUMIF('00 CE'!$B:$B,$A65,'00 CE'!G:G)","v":0},{"$f":"SUMIF('00 CE'!$B:$B,$A65,'00 CE'!F:F)","v":0},0,0]
[null,"ACQUISTI PRESTAZIONI TERMALI IN CONVENZIONE",{"$f":"SUM(C67:C71)","v":2149505.71},{"$f":"SUM(D67:D71)","v":2288663.8299999996},-139158.11999999965,-6.0803215472671521E-2]
["BA1040","- da pubblico (Aziende sanitarie pubbliche della Regione) - Mobilità intraregionale",{"$f":"SUMIF('00 CE'!$B:$B,$A67,'00 CE'!G:G)","v":0},{"$f":"SUMIF('00 CE'!$B:$B,$A67,'00 CE'!F:F)","v":0},0,0]
["BA1050","- da pubblico (altri soggetti pubbl. della Regione)",{"$f":"SUMIF('00 CE'!$B:$B,$A68,'00 CE'!G:G)","v":0},{"$f":"SUMIF('00 CE'!$B:$B,$A68,'00 CE'!F:F)","v":0},0,0]
["BA1060","- da pubblico (Extraregione)",{"$f":"SUMIF('00 CE'!$B:$B,$A69,'00 CE'!G:G)","v":95302.31},{"$f":"SUMIF('00 CE'!$B:$B,$A69,'00 CE'!F:F)","v":159884.29},{"$f":"C69-D69","v":-64581.98000000001},{"$f":"IF(AND(C69=0,D69=0),0,IF(C69=0,\"\",IF(D69=0,\"\",E69/D69)))","v":-0.40392949175932175}]
["BA1070","- da privato",{"$f":"SUMIF('00 CE'!$B:$B,$A70,'00 CE'!G:G)","v":1821580.51},{"$f":"SUMIF('00 CE'!$B:$B,$A70,'00 CE'!F:F)","v":1888589.9699999997},{"$f":"C70-D70","v":-67009.45999999973},-3.548121141403697E-2]
["BA1080","- da privato per cittadini non residenti - Extraregione (mobilità attiva in compensazione)",{"$f":"SUMIF('00 CE'!$B:$B,$A71,'00 CE'!G:G)","v":232622.88999999998},{"$f":"SUMIF('00 CE'!$B:$B,$A71,'00 CE'!F:F)","v":240189.57},{"$f":"C71-D71","v":-7566.6800000000221},-3.1502949940748974E-2]
[]
[null,"Tab. 60 – Dettaglio acquisti di servizi sanitari – II parte"]
["CODICE MOD. CE","DETTAGLIO ACQUISTI DI SERVIZI SANITARI",{"$f":"\"Valore CE \" &'00 Aggregatore'!$F$2","v":"Valore CE 2018"},{"$f":"\"Valore CE \" &'00 Aggregatore'!$F$2 -1","v":"Valore CE 2017"},"Variazioni\nimporto","Variazioni\n%"]
[]
[null,"ACQUISTI PRESTAZIONI DI TRASPORTO SANITARIO",{"$f":"SUM(C77:C80)","v":8783342.459999999},{"$f":"SUM(D77:D80)","v":8512737.8499999996},{"$f":"C76-D76","v":270604.6099999994},{"$f":"IF(AND(C76=0,D76=0),0,IF(C76=0,\"\",IF(D76=0,\"\",E76/D76)))","v":3.1788199609600269E-2}]
["BA1100","- da pubblico (Aziende sanitarie pubbliche della Regione) - Mobilità intraregionale",{"$f":"SUMIF('00 CE'!$B:$B,$A77,'00 CE'!G:G)","v":103216},{"$f":"SUMIF('00 CE'!$B:$B,$A77,'00 CE'!F:F)","v":124342.79},-21126.789999999994,-0.16990764000067873]
["BA1110","- da pubblico (altri soggetti pubbl. della Regione)",{"$f":"SUMIF('00 CE'!$B:$B,$A78,'00 CE'!G:G)","v":0},{"$f":"SUMIF('00 CE'!$B:$B,$A78,'00 CE'!F:F)","v":0},0,0]
["BA1120","- da pubblico (Extraregione)",{"$f":"SUMIF('00 CE'!$B:$B,$A79,'00 CE'!G:G)","v":344124.9},{"$f":"SUMIF('00 CE'!$B:$B,$A79,'00 CE'!F:F)","v":228483.68},115641.22000000003,0.50612463874881586]
["BA1130","- da privato",{"$f":"SUMIF('00 CE'!$B:$B,$A80,'00 CE'!G:G)","v":8336001.5599999996},{"$f":"SUMIF('00 CE'!$B:$B,$A80,'00 CE'!F:F)","v":8159911.3799999999},176090.1799999997,2.1579913285773907E-2]
[null,"ACQUISTI PRESTAZIONI  SOCIO-SANITARIE A RILEVANZA SANITARIA",{"$f":"SUM(C82:C86)","v":16307538.569999998},{"$f":"SUM(D82:D86)","v":16209312.369999997},98226.200000001118,6.059862242015707E-3]
["BA1150","- da pubblico (Aziende sanitarie pubbliche della Regione) - Mobilità intraregionale",{"$f":"SUMIF('00 CE'!$B:$B,$A82,'00 CE'!G:G)","v":1758520.3800000001},{"$f":"SUMIF('00 CE'!$B:$B,$A82,'00 CE'!F:F)","v":1737461.12},21059.260000000009,1.2120708634907473E-2]
["BA1160","- da pubblico (altri soggetti pubblici della Regione)",{"$f":"SUMIF('00 CE'!$B:$B,$A83,'00 CE'!G:G)","v":0},{"$f":"SUMIF('00 CE'!$B:$B,$A83,'00 CE'!F:F)","v":0},0,0]
["BA1170","- da pubblico (Extraregione) non soggette a compensazione",{"$f":"SUMIF('00 CE'!$B:$B,$A84,'00 CE'!G:G)","v":160969.38},{"$f":"SUMIF('00 CE'!$B:$B,$A84,'00 CE'!F:F)","v":168459.48},-7490.1000000000058,-4.4462324114974146E-2]
["BA1180","- da privato (intraregionale)",{"$f":"SUMIF('00 CE'!$B:$B,$A85,'00 CE'!G:G)","v":12500635.899999999},{"$f":"SUMIF('00 CE'!$B:$B,$A85,'00 CE'!F:F)","v":12551624.019999998},-50988.11999999918,-4.0622727320985506E-3]
["BA1190","- da privato (extraregionale)",{"$f":"SUMIF('00 CE'!$B:$B,$A86,'00 CE'!G:G)","v":1887412.9100000001},{"$f":"SUMIF('00 CE'!$B:$B,$A86,'00 CE'!F:F)","v":1751767.75},135645.16000000015,7.7433301303783078E-2]
["BA1200","COMPARTECIPAZIONE AL PERSONALE PER ATT. LIBERO-PROF. (INTRAMOENIA)",{"$f":"SUMIF('00 CE'!$B:$B,$A87,'00 CE'!G:G)","v":3321031.3200000003},{"$f":"SUMIF('00 CE'!$B:$B,$A87,'00 CE'!F:F)","v":3293488.61},{"$f":"C87-D87","v":27542.710000000428},8.3627767578647941E-3]
[null,"RIMBORSI ASSEGNI E CONTRIBUTI SANITARI",{"$f":"SUM(C89:C94)","v":2143960.7800000003},{"$f":"SUM(D89:D94)","v":1751188.4500000002},392772.33000000007,0.22428901355533726]
["BA1290","Contributi ad associazioni di volontariato",{"$f":"SUMIF('00 CE'!$B:$B,$A89,'00 CE'!G:G)","v":349365.76000000001},{"$f":"SUMIF('00 CE'!$B:$B,$A89,'00 CE'!F:F)","v":326600},22765.760000000009,6.970532761788123E-2]
["BA1300","Rimborsi per cure all'estero",{"$f":"SUMIF('00 CE'!$B:$B,$A90,'00 CE'!G:G)","v":2069.39},{"$f":"SUMIF('00 CE'!$B:$B,$A90,'00 CE'!F:F)","v":0},2069.39,""]
["BA1310","Contributi a società partecipate e/o enti dipendenti della Regione",{"$f":"SUMIF('00 CE'!$B:$B,$A91,'00 CE'!G:G)","v":0},{"$f":"SUMIF('00 CE'!$B:$B,$A91,'00 CE'!F:F)","v":0},0,0]
["BA1320","Contributo Legge 210/92",{"$f":"SUMIF('00 CE'!$B:$B,$A92,'00 CE'!G:G)","v":0},{"$f":"SUMIF('00 CE'!$B:$B,$A92,'00 CE'!F:F)","v":0},0,0]
["BA1330","Altri rimborsi, assegni e contributi",{"$f":"SUMIF('00 CE'!$B:$B,$A93,'00 CE'!G:G)","v":1792525.6300000001},{"$f":"SUMIF('00 CE'!$B:$B,$A93,'00 CE'!F:F)","v":1424508.4500000002},368017.17999999993,0.25834678621948498]
["BA1340","Rimborsi, assegni e contributi v/Aziende sanitarie pubbliche della Regione",{"$f":"SUMIF('00 CE'!$B:$B,$A94,'00 CE'!G:G)","v":0},{"$f":"SUMIF('00 CE'!$B:$B,$A94,'00 CE'!F:F)","v":80},-80,""]
[null,"CONSULENZE, COLLABORAZIONI, INTERINALE, ALTRE PRESTAZIONI DI LAVORO SANITARIE E SOCIOSANITARIE",{"$f":"SUM(C96:C98)+C108","v":6574839.0399999991},{"$f":"SUM(D96:D98)+D108","v":6723251.46},{"$f":"SUM(E96:E98)+E108","v":-148412.42000000033},-2.2074500839806509E-2]
["BA1360","Consulenze sanitarie e sociosan. da Aziende sanitarie pubbliche della Regione",{"$f":"SUMIF('00 CE'!$B:$B,$A96,'00 CE'!G:G)","v":416373.3},{"$f":"SUMIF('00 CE'!$B:$B,$A96,'00 CE'!F:F)","v":298526.69},117846.60999999999,0.3947607163701175]
["BA1370","Consulenze sanitarie e sociosanit. da terzi - Altri soggetti pubblici",{"$f":"SUMIF('00 CE'!$B:$B,$A97,'00 CE'!G:G)","v":0},{"$f":"SUMIF('00 CE'!$B:$B,$A97,'00 CE'!F:F)","v":24433.75},-24433.75,""]
["BA1380","Consulenze, Collaborazioni, Interinale e altre prestazioni di lavoro sanitarie e socios. da privato",{"$f":"SUMIF('00 CE'!$B:$B,$A98,'00 CE'!G:G)","v":6104477.8199999994},{"$f":"SUMIF('00 CE'!$B:$B,$A98,'00 CE'!F:F)","v":6390500.9299999997},-286023.11000000034,-4.4757541409199096E-2]
["BA1390","Consulenze sanitarie da privato - articolo 55, comma 2, CCNL 8 giugno 2000",{"$f":"SUMIF('00 CE'!$B:$B,$A99,'00 CE'!G:G)","v":2164804.17},{"$f":"SUMIF('00 CE'!$B:$B,$A99,'00 CE'!F:F)","v":2372315.1800000002},-207511.01000000024,-8.7471939542198701E-2]
["BA1400","Altre consulenze sanitarie e sociosanitarie da privato",{"$f":"SUMIF('00 CE'!$B:$B,$A100,'00 CE'!G:G)","v":4381.71},{"$f":"SUMIF('00 CE'!$B:$B,$A100,'00 CE'!F:F)","v":8005.29},-3623.58,-0.45264818638675175]
["BA1410","Collaborazioni coordinate e continuative sanitarie e socios. da privato",{"$f":"SUMIF('00 CE'!$B:$B,$A101,'00 CE'!G:G)","v":0},{"$f":"SUMIF('00 CE'!$B:$B,$A101,'00 CE'!F:F)","v":8413.1200000000008},-8413.1200000000008,""]
["BA1420","Indennità a personale universitario - area sanitaria ",{"$f":"SUMIF('00 CE'!$B:$B,$A102,'00 CE'!G:G)","v":256736.03},{"$f":"SUMIF('00 CE'!$B:$B,$A102,'00 CE'!F:F)","v":242210.34},14525.690000000002,5.9971386853261519E-2]
["BA1430","Lavoro interinale - area sanitaria ",{"$f":"SUMIF('00 CE'!$B:$B,$A103,'00 CE'!G:G)","v":2862789.15},{"$f":"SUMIF('00 CE'!$B:$B,$A103,'00 CE'!F:F)","v":2608784.9},254004.25,9.7364964815612048E-2]
["BA1440","Altre collaborazioni e prestazioni di lavoro - area sanitaria ",{"$f":"SUMIF('00 CE'!$B:$B,$A104,'00 CE'!G:G)","v":815766.76},{"$f":"SUMIF('00 CE'!$B:$B,$A104,'00 CE'!F:F)","v":1150772.0999999999},-335005.33999999985,-0.29111354020487629]
["BA1450","Rimborso oneri stipendiali del personale sanitario in comando",{"$f":"SUMIF('00 CE'!$B:$B,$A105,'00 CE'!G:G)","v":53987.92},{"$f":"SUMIF('00 CE'!$B:$B,$A105,'00 CE'!F:F)","v":9790.09},44197.83,4.514547874432207]
["BA1460","Rimborso oneri stipendiali personale sanitario in comando da Aziende sanitarie pubbliche della Regione",{"$f":"SUMIF('00 CE'!$B:$B,$A106,'00 CE'!G:G)","v":0},{"$f":"SUMIF('00 CE'!$B:$B,$A106,'00 CE'!F:F)","v":0},0,0]
["BA1470","Rimborso oneri stipendiali personale sanitario in comando da Regioni, soggetti pubblici e da Università",{"$f":"SUMIF('00 CE'!$B:$B,$A107,'00 CE'!G:G)","v":0},{"$f":"SUMIF('00 CE'!$B:$B,$A107,'00 CE'!F:F)","v":0},0,0]
["BA1480","Rimborso oneri stipendiali personale sanitario in comando da aziende di altre Regioni (Extraregione)",{"$f":"SUMIF('00 CE'!$B:$B,$A108,'00 CE'!G:G)","v":53987.92},{"$f":"SUMIF('00 CE'!$B:$B,$A108,'00 CE'!F:F)","v":9790.09},44197.83,4.514547874432207]
[null,"ALTRI SERVIZI SANITARI E SOCIOSANITARI A RILEVANZA SANITARIA",{"$f":"SUM(C110:C114)","v":5607016.7799999993},{"$f":"SUM(D110:D114)","v":2754715.62},2852301.1599999992,1.0354249053120042]
["BA1500","Altri servizi sanitari e sociosanitari a rilevanza sanitaria da pubblico - Aziende sanitarie pubbliche della Regione",{"$f":"SUMIF('00 CE'!$B:$B,$A110,'00 CE'!G:G)","v":0},{"$f":"SUMIF('00 CE'!$B:$B,$A110,'00 CE'!F:F)","v":13109.54},-13109.54,""]
["BA1510","Altri servizi sanitari e sociosanitari a rilevanza sanitaria da pubblico - Altri soggetti pubblici della Regione",{"$f":"SUMIF('00 CE'!$B:$B,$A111,'00 CE'!G:G)","v":0},{"$f":"SUMIF('00 CE'!$B:$B,$A111,'00 CE'!F:F)","v":0},0,0]
["BA1520","Altri servizi sanitari e sociosanitari a rilevanza sanitaria da pubblico (Extraregione)",{"$f":"SUMIF('00 CE'!$B:$B,$A112,'00 CE'!G:G)","v":0},{"$f":"SUMIF('00 CE'!$B:$B,$A112,'00 CE'!F:F)","v":0},0,0]
["BA1530","Altri servizi sanitari da privato",{"$f":"SUMIF('00 CE'!$B:$B,$A113,'00 CE'!G:G)","v":3534647.28},{"$f":"SUMIF('00 CE'!$B:$B,$A113,'00 CE'!F:F)","v":2741606.08},793041.19999999972,0.28926154117662289]
["BA1540","Costi per servizi sanitari - Mobilità internazionale passiva",{"$f":"SUMIF('00 CE'!$B:$B,$A114,'00 CE'!G:G)","v":2072369.5},{"$f":"SUMIF('00 CE'!$B:$B,$A114,'00 CE'!F:F)","v":0},2072369.5,""]
["BA1550","COSTI PER DIFFERENZIALE TARIFFE TUC",{"$f":"SUMIF('00 CE'!$B:$B,$A115,'00 CE'!G:G)","v":0},{"$f":"SUMIF('00 CE'!$B:$B,$A115,'00 CE'!F:F)","v":0},0,0]
[null,"TOTALE",{"$f":"C66+C59+C53+C43+C38+C33+C27+C16+C12+C4+C76+C81+C87+C88+C95+C109+C115","v":331170827.86999995},{"$f":"D66+D59+D53+D43+D38+D33+D27+D16+D12+D4+D76+D81+D87+D88+D95+D109+D115","v":331559072.38},-388244.51000002259,-1.1709663295084124E-3]

{"sheet":"Farmaceutica Convenzionata","index":16,"n_rows":11,"n_cols":2,"rows_kept":11,"cut":false,"hidden":false,"merged":[[0,0,0,6],[4,0,4,1]]}
["DETTAGLIO SPESA FARMACEUTICA CONVENZIONATA"]
[]
[]
[]
["Spesa Farmaceutica Convenzionata \nConsuntivo 2018"]
["Spesa farmaceutica netta",49975066.649999999]
["Contributo ENFAP",30403.759999999998]
["Contributi a farmacie rurali",124207.82]
[" Altro (*) "]
["TOTALE  ",{"$f":"SUM(B6:B9)","v":50129678.229999997}]
["valori in €"]

{"sheet":"AS01-AS02","index":17,"n_rows":76,"n_cols":5,"rows_kept":76,"cut":false,"hidden":false,"merged":[[30,0,30,9],[59,1,59,9],[62,1,62,4],[0,0,0,3],[2,0,2,1],[2,2,2,3],[2,4,2,9],[3,0,3,1],[3,4,3,9],[8,0,8,9],[6,0,6,9],[5,0,5,9],[9,0,9,9],[21,1,21,2],[7,0,7,9],[17,0,17,9]]}
["Altre informazioni relative a acquisti di servizi"]
[]
["Informazione",null,"Caso presente in azienda?",null,"Se sì, illustrare"]
["AS01. Sono state rilevate significative variazioni rispetto all'esercizio precedente? ",null,null,"SI","Si veda commento sottostante."]
[]
["Complessivamente, il costo totale per l'acquisto di servizi sanitari ha subito un decremento di €/000 388. Le variazioni più significative hanno riguardato: "]
["Il costo per acquisti di servizi sanitari per assistenza farmaceutica si è ridotto rispetto al 2017 di - €/000 2.700. Tale variazione è riconducibile alla minore spesa per farmaceutica convenzionata in ragione dell’avvio della DPC, a partire dal mese di Agosto 2018."]
["Il costo per acquisti di servizi sanitari - assistenza ospedaliera si è ridotto rispetto al 2017 di complessivi - €/000 1.517. Tale variazione è ascrivibile in parte alla riduzione del costo di acquisto di prestazioni di assistenza ospedaliera da aziende sanitarie pubbliche della Regione (mobilità passiva infraregionale), per -€/000 1.748, ed in parte alla riduzione del costo di acquisto di prestazioni ospedaliere rese da privato accreditato nei confronti di pazienti residenti in territorio extraregionale (per - €/000 1.632. Tale riduzione trova in parte giustificazione nel fatto che nel 2017 erano state fatturate prestazioni in extrabudget per €/000 660, di cui si attendono le richieste note di credito). Tali variazioni sono state compensate in parte dall'incremento dei costi di acquisto di prestazioni ospedaliere da aziende sanitarie pubbliche site al di fuori del territorio regionale (mobilità passiva extraregionale), per €/000 1.009, ed in parte all'aumento del costo di acquisto di prestazioni ospedaliere rese da strutture private accreditate nei confronti di cittadini residenti nella Regione in territorio extra ASL, per €/000 1.000."]
["Il costo per acquisti di prestazioni di distribuzione farmaci File F è aumentato di circa €/000 1.116. In particolare, detta variazione è dovuta sia all'aumento dei costi per l'acquisto di prestazioni di distribuzione farmaci File F da pubblico extraregione (per €/000 610), sia ai costi per il servizio di distribuzione farmaci PHT (DPC) da parte delle farmacie (€/000 433), non esistenti nel 2017. "]
["Il costo per acquisti di altri servizi sanitari e sociosanitari a rilevanza sanitaria è aumentato di circa €/000 2.852, soprattutto per effetto del costo per mobilità internazionale passiva, rilevata in contabilità sulla base di quanto comunicato dalla Regione nelle Linee Guida al Bilancio di esercizio 2018 (Allegato 7 alla nota prot. n. 0122860/DPF012 del 19/04/2019). "]
[]
[]
[]
[]
[]
[]
[]
["Si rappresenta di seguito la suddivisione del costo medici SUMAI tra le varie tipologie specialistiche:"]
[]
[]
[]
[null,"Costo medici SUMAI\n CONSUNTIVO 2018 "]
[null,"Tipologia"]
[null,"Medici",4006135.53]
[null,"Veterinari",319777.40999999997]
[null,"Psicologi",160831.26999999999]
[null,"Penitenziaria",0]
[null,"Sert",0]
[null,"TOTALE",{"$f":"SUM(C24:C28)","v":4486744.209999999}]
[]
["Si precisa che nel costo della Specialistica ambulatoriale è compresa anche la spesa sostenuta per la Penitenziaria ed il Sert, in quanto queste ultime prestazioni vengono rese dagli stessi medici specialisti che contemporaneamente lavorano presso i Distretti."]
[]
[]
[]
[]
[]
[]
[]
[]
[]
[]
[]
[]
[]
[]
[]
[]
[]
[]
[]
[]
[]
[]
[]
[]
["AS02 - Costi per prestazioni sanitarie da privato"]
[]
[]
["AS02 - Costi per prestazioni sanitarie da privato"]
["AS02 - SI","Con riferimento ai costi per acquisto da privati accreditati di prestazioni sanitarie si evidenzia per l’anno 2018 un volume complessivo del fatturato prodotto leggermente inferiore ai tetti di spesa assegnati. Le prestazioni per Ricoveri Ospedalieri,  Ambulatoriali Branche a Visita e Termali  presentano un fatturato complessivo entro i tetti di spesa annuale assegnati; per le prestazioni in R.A.  si è già provveduto al saldo finale di liquidazione con il pieno rispetto del Budget assegnato; le prestazioni di Psico- riabilitazione,  Ambulatoriali e Riabilitative presentano un surplus di fatturato rispetto al budget assegnato che, al momento della liquidazione del saldo anno 2018,  dovrà essere riassorbito a seguito dell'emissione di apposite note di credito da parte delle strutture interessate. Al riguardo, solo per le prestazioni in RSA si è provveduto al calcolo definitivo dell'extra budget con l'iscrizione di apposite note di credito da ricevere."]
[]
[]
[null,"DETTAGLIO SCOSTAMENTI FATTURATO/BUDGET PER SPECIALITA'"]
[]
[null,"Tipologia","Fatturato","Budget","Scostamento"]
[]
[null,"RICOVERI",73046503,73127326,{"$f":"C67-D67","v":-80823}]
[null,"RES. PROT.",8976023.7100000009,8578336,{"$f":"C68-D68","v":397687.71000000089}]
[null,"R.S.A.",5022017,5001203,20814]
[null,"R.A.",772776,772776,0]
[null,"TERMALI",2546565.6,3286169,-739603.39999999991]
[null,"RIABILITAZIONE",14612451.73,14535122,77329.730000000447]
[null,"AMB. C.D.C.",6918779.5,6806648,112131.5]
[null,"AMB. PRIV.",3587317.51,3527428,59889.509999999776]
[null,"BRAN. A VISIT.",35902.49,45260,-9357.510000000002]
[null,"TOTALE GENERALE",{"$f":"SUM(C67:C75)","v":115518336.54000001},115680268,{"$f":"SUM(E67:E75)","v":-161931.4599999988}]

{"sheet":"Tab 60-bis","index":18,"n_rows":47,"n_cols":9,"rows_kept":47,"cut":false,"hidden":false,"merged":[[0,0,0,8],[5,8,7,8],[26,5,28,5],[26,6,28,6],[26,7,28,7],[26,8,28,8],[4,0,4,8],[5,0,7,0],[5,1,7,1],[5,2,7,2],[5,3,7,3],[26,0,28,0],[26,1,28,1],[26,2,28,2],[26,3,28,3],[26,4,28,4],[5,4,7,4],[5,5,7,5],[5,6,7,6],[5,7,7,7]]}
["Tabella 60-bis - Consulenze sanitarie da privato - articolo 55, comma2, CCNL 8 giugno 2000"]
[]
["Si riporta di seguito il dettaglio dei costi per Consulenze sanitarie da privato - articolo 55, comma2, CCNL 8 giugno 2000, contabilizzate nella voce di conto 0702011503."]
[]
["Dettaglio composizione voce BA1390 \nConsulenze Sanitarie da Privato \nCONSUNTIVO 2018"]
["Medici "," Sede di appartenenza ","Linee di attività ","Motivazione ","Sede di Erogazione della prestazione ","Importo ","Irap ","Totale ","Note "]
[]
[]
["Dirigenza Medica","UOC Centro Trasfusionale","Attività Ambulatoriale","Raccolta Sangue","PO Pescara - PO Penne - PO Popoli",168322.43,14307.41,182629.84]
["Dirigenza Medica","UOC Nefrologia e Dialisi","Trattamenti Dialitici","3° Turno di Dialisi","PO Pescara",94740,8052.88,102792.88]
["Dirigenza Medica","UOC Ematologia","Attività Domiciliare","Deospedalizzazione","PO Pescara",40082,3406.99,43488.99]
["Dirigenza Medica","UOS Assistenza Intermedia","Attività Domiciliare","Deospedalizzazione","PO Pescara",16950.000000000004,1440.7399999999998,18390.740000000005]
["Dirigenza Medica","UOC Servizio Territoriale 118","Turni Guardia Notturna","Carenza Personale","Area Territoriale Asl Pescara",221280,18808.8,240088.8]
["Dirigenza Medica","UO varie","Attività Ambulatoriale","Riduzione Liste d'Attesa","PO Pescara - PO Penne - PO Popoli",14377.78,935.37,15313.150000000001]
["Dirigenza Medica","UOC Pronto Soccorso","Turni Guardia Notturna","Carenza Personale","PO Pescara - PO Penne - PO Popoli",23520,1999.2099999999996,25519.21]
["Dirigenza Medica","UOC Laboratorio Analisi","Attività Ambulatoriale","Convenzione Forze Ordine","PO Pescara",20687.349999999999,1519.0700000000002,22206.42]
["Dirigenza Medica","UO varie Area Chirurgica","Sedute Operatorie","Riduzione Liste d'Attesa","PO Pescara - PO Penne - PO Popoli",319530,27159.959999999995,346689.96]
["Dirigenza Medica","UO Malattie Infettive","Attività Ambulatoriale","Monitoraggio HIV","PO Pescara",22779.68,1936.2699999999998,24715.95]
["Dirigenza Medica","UO varie","Attività Ambulatoriale","Riduzione Liste d'Attesa","PO Pescara",67607.12,4645.3100000000004,72252.429999999993]
[]
[]
[]
[]
[]
["Totale (A)  ",null,null,null,null,1009876.36,84212.01,1094088.3699999999]
[]
["Altre  Qualifiche  Professionali \n   (Specificare) "," Sede di appartenenza ","Linee di attività ","Motivazione ","Sede di Erogazione della prestazione ","Importo ","Irap ","Totale ","Note "]
[]
[]
["Personale di Equipe","UOC Centro Trasfusionale","Attività Ambulatoriale","Raccolta Sangue","PO Pescara - PO Penne - PO Popoli",248310.09,17048.440000000002,265358.53000000003]
["Personale di Equipe","UOC Nefrologia e Dialisi","Trattamenti Dialitici","3° Turno di Dialisi","PO Pescara",312168.11,21433.31,333601.42]
["Personale di Equipe","UO varie","Turni Guardia Notturna","Carenza Personale","PO Pescara - PO Penne - PO Popoli",46480,3950.7999999999997,50430.8]
["Personale di Equipe","UOC Ematologia","Attività Domiciliare","Deospedalizzazione","PO Pescara",25107.809999999998,1723.92,26831.729999999996]
["Personale di Equipe","UOS Assistenza Intermedia","Attività Domiciliare","Deospedalizzazione","PO Pescara",12049.42,827.3,12876.72]
["Personale di Equipe","UOC Centro Trasfusionale","Attività Ambulatoriale","Raccolta Sangue","PO Pescara - PO Penne - PO Popoli",39483.78,3356.1,42839.88]
["Personale di Equipe","UO varie","Attività Ambulatoriale","Riduzione Liste d'Attesa","PO Pescara - PO Penne - PO Popoli",22233.91,1231.93,23465.84]
["Personale di Equipe","UO Malattie Infettive","Attività Ambulatoriale","Monitoraggio HIV","PO Pescara",43816.01,3006.2100000000005,46822.22]
["Personale di Equipe","UOC Laboratorio Analisi","Attività Ambulatoriale","Convenzione Forze Ordine","PO Pescara",91904.089999999982,5753.4,97657.489999999976]
["Personale di Equipe","UO varie Area Chirurgica","Sedute Operatorie","Riduzione Liste d'Attesa","PO Pescara - PO Penne - PO Popoli",267147.48000000004,15869.78000000001,283017.26000000007]
["Personale di Equipe","UO varie","Attività Ambulatoriale","Riduzione Liste d'Attesa","PO Pescara",38249.990000000005,1802.2299999999996,40052.22]
["Personale di Equipe","UO varie","Sperimentazione","Convenzione Enti Diversi","PO Pescara",7977.12,244.56,8221.68]
[]
[]
[]
[]
["Totale  (B)",null,null,null,null,1154927.8100000003,76247.98000000001,1231175.7899999998]
["TOTALE ( A+B)",null,null,null,null,2164804.1700000004,160459.99,2325264.1599999997]

{"sheet":"Tab 61","index":19,"n_rows":63,"n_cols":13,"rows_kept":63,"cut":false,"hidden":false,"merged":[[53,0,54,0],[53,1,54,1],[53,2,54,2],[53,3,54,3],[13,7,14,7],[15,7,16,7],[53,4,54,4],[53,7,54,7],[41,6,42,6],[15,8,16,8],[15,9,16,9],[39,8,40,8],[39,9,40,9],[35,2,36,2],[35,3,36,3],[35,4,36,4],[35,7,36,7],[35,8,36,8],[35,9,36,9],[19,8,20,8],[19,9,20,9],[21,4,22,4],[21,7,22,7],[21,8,22,8],[21,9,22,9],[25,8,26,8],[33,9,34,9],[37,6,38,6],[39,6,40,6],[19,4,20,4],[19,7,20,7],[33,6,34,6],[35,6,36,6],[55,11,56,11],[57,0,58,0],[57,2,58,2],[57,3,58,3],[57,4,58,4],[57,7,58,7],[57,8,58,8],[57,9,58,9],[55,0,56,0],[55,1,56,1],[55,2,56,2],[55,3,56,3],[55,4,56,4],[55,7,56,7],[55,8,56,8],[55,9,56,9],[55,10,56,10],[57,10,58,10],[55,6,56,6],[57,6,58,6],[53,8,54,8],[53,9,54,9],[53,10,54,10],[53,11,54,11],[51,1,52,1],[51,2,52,2],[51,3,52,3],[51,4,52,4],[51,7,52,7],[51,8,52,8],[51,9,52,9],[51,10,52,10],[51,11,52,11],[51,6,52,6],[53,6,54,6],[47,11,48,11],[49,1,50,1],[49,2,50,2],[49,3,50,3],[49,4,50,4],[49,7,50,7],[49,8,50,8],[49,9,50,9],[49,10,50,10],[49,11,50,11],[47,1,48,1],[47,2,48,2],[47,3,48,3],[47,4,48,4],[47,7,48,7],[47,8,48,8],[47,9,48,9],[47,10,48,10],[47,6,48,6],[49,6,50,6],[43,11,44,11],[45,1,46,1],[45,2,46,2],[45,3,46,3],[45,4,46,4],[45,7,46,7],[45,8,46,8],[45,9,46,9],[45,10,46,10],[45,11,46,11],[43,1,44,1],[43,2,44,2],[43,3,44,3],[43,4,44,4],[43,7,44,7],[43,8,44,8],[43,9,44,9],[43,10,44,10],[43,6,44,6],[45,6,46,6],[41,11,42,11],[39,0,40,0],[39,1,40,1],[39,2,40,2],[39,3,40,3],[39,4,40,4],[39,7,40,7],[39,10,40,10],[33,0,34,0],[33,1,34,1],[33,2,34,2],[33,3,34,3],[41,0,42,0],[41,1,42,1],[41,2,42,2],[41,3,42,3],[41,4,42,4],[41,7,42,7],[41,8,42,8],[41,9,42,9],[41,10,42,10],[33,4,34,4],[33,7,34,7],[33,8,34,8],[17,10,18,10],[21,10,22,10],[33,10,34,10],[35,10,36,10],[39,11,40,11],[17,11,18,11],[23,0,24,0],[23,1,24,1],[23,2,24,2],[23,3,24,3],[23,4,24,4],[23,7,24,7],[23,8,24,8],[23,9,24,9],[23,10,24,10],[23,11,24,11],[21,0,22,0],[21,1,22,1],[21,2,22,2],[21,3,22,3],[19,0,20,0],[19,1,20,1],[19,2,20,2],[19,3,20,3],[19,10,20,10],[19,11,20,11],[17,9,18,9],[13,11,14,11],[13,0,14,0],[13,1,14,1],[13,2,14,2],[13,3,14,3],[13,4,14,4],[13,8,14,8],[13,9,14,9],[13,10,14,10],[15,4,16,4],[17,0,18,0],[17,1,18,1],[17,2,18,2],[17,3,18,3],[17,4,18,4],[17,7,18,7],[17,8,18,8],[15,0,16,0],[15,1,16,1],[15,2,16,2],[15,3,16,3],[9,0,10,0],[9,1,10,1],[9,2,10,2],[9,3,10,3],[9,4,10,4],[9,7,10,7],[9,8,10,8],[9,9,10,9],[9,10,10,10],[11,1,12,1],[11,2,12,2],[11,3,12,3],[11,4,12,4],[11,7,12,7],[11,8,12,8],[11,9,12,9],[11,10,12,10],[11,11,12,11],[15,10,16,10],[15,11,16,11],[5,11,6,11],[7,0,8,0],[7,1,8,1],[7,2,8,2],[7,3,8,3],[7,4,8,4],[7,7,8,7],[7,8,8,8],[7,9,8,9],[7,10,8,10],[7,11,8,11],[5,0,6,0],[5,1,6,1],[5,2,6,2],[5,3,6,3],[5,4,6,4],[5,7,6,7],[5,8,6,8],[5,9,6,9],[5,10,6,10],[9,11,10,11],[11,0,12,0],[1,9,2,9],[1,10,2,10],[1,11,2,11],[1,12,2,12],[3,0,4,0],[3,1,4,1],[3,2,4,2],[3,3,4,3],[3,4,4,4],[3,7,4,7],[3,8,4,8],[3,9,4,9],[3,10,4,10],[3,11,4,11],[0,0,0,8],[1,0,2,0],[1,1,2,1],[1,2,2,2],[1,3,2,3],[1,4,2,4],[1,5,2,6],[1,7,2,7],[1,8,2,8],[21,11,22,11],[27,0,28,0],[27,1,28,1],[27,2,28,2],[27,3,28,3],[27,4,28,4],[27,7,28,7],[27,8,28,8],[27,9,28,9],[27,10,28,10],[27,11,28,11],[25,11,26,11],[25,0,26,0],[25,1,26,1],[25,2,26,2],[25,3,26,3],[25,4,26,4],[25,7,26,7],[25,9,26,9],[25,10,26,10],[29,11,30,11],[31,0,32,0],[31,1,32,1],[31,2,32,2],[31,3,32,3],[31,4,32,4],[31,7,32,7],[31,8,32,8],[31,9,32,9],[31,10,32,10],[31,11,32,11],[29,0,30,0],[29,1,30,1],[29,2,30,2],[29,3,30,3],[29,10,30,10],[29,4,30,4],[29,7,30,7],[29,8,30,8],[29,9,30,9],[33,11,34,11],[59,0,60,0],[59,1,60,1],[59,2,60,2],[59,3,60,3],[59,4,60,4],[59,7,60,7],[59,8,60,8],[59,9,60,9],[59,10,60,10],[59,11,60,11],[35,11,36,11],[37,0,38,0],[37,1,38,1],[37,2,38,2],[37,3,38,3],[37,4,38,4],[37,7,38,7],[37,8,38,8],[37,9,38,9],[37,10,38,10],[37,11,38,11],[35,0,36,0],[35,1,36,1],[61,10,62,10],[61,11,62,11],[61,0,62,0],[61,1,62,1],[61,2,62,2],[61,3,62,3],[61,4,62,4],[61,7,62,7],[61,8,62,8],[61,9,62,9]]}
["Tab. 61 – Dettaglio acquisti di servizi sanitari da privato"]
["DETTAGLIO ACQUISTI DI SERVIZI SANITARI - DA PRIVATO","Codice Struttura da classificazione NSIS","Partita IVA (o Codice Fiscale)","Tipologia di prestazione","Anno di competenza","Importo fatturato",null,"Budget / Tetto annuale","Importo liquidato/ certificato","Importo Rilevato in Co.Ge.","Importo delle note di credito richieste","Importo delle note di credito ricevute","Importo pagato"]
[null,"Codice Struttura Sts11","Partita Iva",null,null,null,null,"Valore Considerato A Budget Nella Fase Di Liquidazione - Per L'Anno 2008 E Ante Indicare La Parte Residua, Ovvero Il Delta Rilevato Tra Importo Fatturato (Al Netto Di Eventuali Note Di Credito) Ed Il Budget Di Riferimento.",null,"Importo Rilevato In Coge","Importo Delle Note Di Credito Richieste","Importo Delle Note Di Credito Richieste"]
["C.D.C. VILLA SERENA",130024,1220790685,"Ricoveri",2018,"Regionale",33477145.789999999,37973805,{"$f":"M4+M5","v":36380161.620000005},{"$f":"G4+G5","v":37892615.619999997},null,0,32546789.690000001]
[null,null,null,null,null,"Extra-regionale",4415469.83,null,null,null,null,null,3833371.93]
["C.D.C. SYNERGO",130022,62520689,"Ricoveri",2018,"Regionale",29283474.539999999,35153521,{"$f":"M6+M7","v":33416879.57},{"$f":"G6+G7","v":35153887.850000001},0,0,27793229.719999999]
[null,null,null,null,null,"Extra-regionale",5870413.3099999996,null,null,null,null,null,5623649.8499999996]
["C.D.C. VILLA SERENA","001302 - 001312",1220790685,"Residenze protette",2018,"Regionale",8976023.7100000009,8578336.3399999999,{"$f":"M8+M9","v":8575911.7100000009},{"$f":"G8+G9","v":8976023.7100000009},0,0,8575911.7100000009]
[null,null,null,null,null,"Extra-regionale",0,null,null,null,null,null,0]
["C.D.C. VILLA SERENA","001313",1220790685,"R.S.A.",2018,"Regionale",2133877.5499999998,1861701,{"$f":"M10+M11","v":1861700.75},{"$f":"G10+G11-K10","v":1861700.7499999998},272176.8,272177,1861700.75]
[null,null,null,null,null,"Extra-regionale",0,null,null,null,null,null,0]
["C.I.S.E.",130119,1741480683,"R.S.A.",2018,"Regionale",618158.62,737495.64,{"$f":"M12+M13","v":618158.62},{"$f":"G12+G13","v":618158.62},0,0,618158.62]
[null,null,null,null,null,"Extra-regionale",0,null,null,null,null,null,0]
["CASA DI CURA MEDAGLIA D'ORO DE CESARIS S.P.A.","006246","00117030684","R.S.A.",2018,"Regionale",2269981.04,2402007,{"$f":"M14+M15","v":2269981.04},{"$f":"G14+G15","v":2269981.04},0,0,2269981.04]
[null,null,null,null,null,"Extra-regionale",0,null,null,null,0,0,0]
["IL GIARDINO",130108,1562130680,"R.A.",2018,"Regionale",772775.72,772775.72,{"$f":"M16+M17","v":772775.72},{"$f":"G16+G17","v":772775.72},24647.57,24647.57,772775.72]
[null,null,null,null,null,"Extra-regionale",0]
["TERME DI POPOLI","018101",1125990687,"Termali",2018,"Regionale",623138.81999999995,769864,{"$f":"M18+M19","v":657216.94999999995},{"$f":"G18+G19","v":657216.94999999995},1221.28,1221.28,623138.81999999995]
[null,null,null,null,null,"Extra-regionale",34078.129999999997,null,null,null,null,null,34078.129999999997]
["TERME DI CARAMANICO","018001",1113020687,"Termali",2018,"Regionale",1635181.79,2516305,{"$f":"M20+M21","v":1889348.65},{"$f":"G20+G21","v":1889348.65},11393.66,11393.66,1635181.79]
[null,null,null,null,null,"Extra-regionale",254166.86,null,null,null,null,null,254166.86]
["IST. DON ORIONE",130063,1105681009,"Riabilitazione",2018,"Regionale",4041021.11,3919657.15,{"$f":"M22+M23","v":3917943},{"$f":"G22+G23","v":4041021.11},123078.41,123078.41,3917943]
[null,null,null,null,null,"Extra-regionale"]
["FOND. PAPA PAOLO VI","130060/64/65/79/80/81/82",1127170684,"Riabilitazione",2018,"Regionale",8714519.3900000006,8723716.8800000008,{"$f":"M24+M25","v":7078664.8399999999},{"$f":"G24+G25","v":8714519.3900000006},0,0,7078664.8399999999]
[null,null,null,null,null,"Extra-regionale"]
["SAN STEF AR SRL","130061-130062",2014620682,"Riabilitazione",2018,"Regionale",1703822.35,1703625,{"$f":"M26+M27","v":1703481},{"$f":"G26+G27","v":1703822.35},341.35,341.35,1703481]
[null,null,null,null,null,"Extra-regionale"]
["CENTRO DI SOLIDARIETA' ASS.GRUP.S. ONLUS",130777,91002370681,"Riabilitazione",2018,"Regionale",153088.88,188123.32,{"$f":"M28+M29","v":153089},{"$f":"G28+G29","v":153088.88},539.63,539.63,153089]
[null,null,null,null,null,"Extra-regionale"]
["C.D.C. VILLA SERENA","001301-001314-001315",1220790685,"Ambulatoriale Case di Cura",2018,"Regionale",3727002.53,3706204,{"$f":"M30+M31","v":3766449.13},{"$f":"G30+G31","v":3818335.5},"In corso conteggio per richiesta N.C.",0,3676208.3]
[null,null,null,null,null,"Extra-regionale",91332.97,null,null,null,null,null,90240.83]
["C.D.C. SYNERGO","000501-000502-000503",62520689,"Ambulatoriale Case di Cura",2018,"Regionale",3036124.48,3100444,{"$f":"M32+M33","v":3023375.4000000004},{"$f":"G32+G33","v":3100444},0,0,2960408.43]
[null,null,null,null,null,"Extra-regionale",64319.519999999997,null,null,null,null,null,62966.97]
["ISTITUTO DON ORIONE ","003101",1105681009,"Ambulatoriale Altri Privati",2018,"Regionale",146547.85999999999,141137,{"$f":"M34+M35","v":136816.66999999998},{"$f":"G34+G35","v":146680.47999999998},5667.44,5667.44,136733.54999999999]
[null,null,null,null,null,"Extra-regionale",132.62,null,null,null,null,null,83.12]
["CENTRO FISIOCHINESITERAPICO DELLA DOT.MASCI GIOVANNA & C. S.A.S.","003801",1103910681,"Ambulatoriale Altri Privati",2018,"Regionale",271938.42,274626,{"$f":"M36+M37","v":261454.15000000002},{"$f":"G36+G37","v":275407.27999999997},803.28,803.28,258085.89]
[null,null,null,null,null,"Extra-regionale",3468.86,null,null,null,null,null,3368.26]
["VUZA MARIA & C S.A.S.","003601",1107760686,"Ambulatoriale Altri Privati",2018,"Regionale",217212.22,218182,{"$f":"M38+M39","v":211799.09},{"$f":"G38+G39","v":221099.95},0,0,208071.35]
[null,null,null,null,null,"Extra-regionale",3887.73,null,null,null,null,null,3727.74]
["FISIOTER S.A.S.","003401",944790682,"Ambulatoriale Altri Privati",2018,"Regionale",395005.85,403623,379443.89,{"$f":"G40+G41","v":403632.13},0,0,371018.02]
[null,null,null,null,null,"Extra-regionale",8626.2800000000007,null,null,null,null,null,8425.8700000000008]
["CLINITEST S.R.L.","010501",200370682,"Ambulatoriale Altri Privati",2018,"Regionale",51746.83,51611,42320.479999999996,{"$f":"G42+G43","v":51883.58},0,0,42214.21]
[null,null,null,null,null,"Extra-regionale",136.75,null,null,null,null,null,106.27]
["CO.PAN SAS ISTITUTO DI FISIOKINESITERAPIA","009151",908760689,"Ambulatoriale Altri Privati",2018,"Regionale",143104.59,135987,135499.71000000002,{"$f":"G44+G45","v":143894.82},8007.72,8007.72,134714.29]
[null,null,null,null,null,"Extra-regionale",790.23,null,null,null,null,null,785.42]
["4R SNC STUDIO DI RADIOLOGIA MEDICA","003701",307580688,"Ambulatoriale Altri Privati",2018,"Regionale",74406.06,75011,71969.459999999992,{"$f":"G46+G47","v":74686.720000000001},0,0,71691.649999999994]
[null,null,null,null,null,"Extra-regionale",280.66000000000003,null,null,null,null,null,277.81]
["COLAROSSI ROBERTO & C. SAS","004201",1339250688,"Ambulatoriale Altri Privati",2018,"Regionale",109539.83,109575,104617.67,{"$f":"G48+G49","v":109539.83},0,0,104617.67]
[null,null,null,null,null,"Extra-regionale",0,null,null,null,null,null,0]
["RADIOLOGIA MEDICA REGINA MARGHERITA","010801",322520685,"Ambulatoriale Altri Privati",2018,"Regionale",113984.56,112961,92902.07,{"$f":"G50+G51","v":114550.31999999999},0,0,92440.83]
[null,null,null,null,null,"Extra-regionale",565.76,null,null,null,null,null,461.24]
["BLEU  SRL RADIOLOGIA","004501",997880687,"Ambulatoriale Altri Privati",2018,"Regionale",392239.66,{"$f":"176290+189573","v":365863},337501.13,{"$f":"G52+G53","v":396387.27999999997},30681.71,30681.71,333764]
[null,null,null,null,null,"Extra-regionale",4147.62,null,null,null,null,null,3737.13]
["DOTT. ROLANDO COLLEVECCHIO","009601",1093440681,"Ambulatoriale Altri Privati",2018,"Regionale",30970.89,23833,15167.18,{"$f":"G54+G55","v":31216.85},0,0,14984.85]
[null,null,null,null,null,"Extra-regionale",245.96,null,null,null,null,null,182.33]
["CONSORZIO GRUPPO ATQ",null,1959880681,"Ambulatoriale Altri Privati",2018,"Regionale",1026009.06,1035060,811077.55999999994,{"$f":"G56+G57","v":1037831.4400000001},0,0,801785.62]
[null,null,null,null,null,"Extra-regionale",11822.38,null,null,null,null,null,9291.94]
["LIFECARE S.R.L.",null,3435870286,"Ambulatoriale Altri Privati",2018,"Regionale",568765.80000000005,579959,451402.50999999995,{"$f":"G58+G59","v":580506.83000000007},0,0,442369.35]
[null,null,null,null,null,"Extra-regionale",11741.03,null,null,null,null,0,9033.16]
["DOTT.SSA ORLANDI","014401",1212420689,"Branche a visita",2018,"Regionale",16404.07,22554,13178.41,{"$f":"G60+G61","v":16404.07},0,0,13178.41]
[null,null,null,null,null,"Extra-regionale",0,null,null,null,null,null,0]
["DOTT. MINICUCCI","006001",1887300687,"Branche a visita",2018,"Regionale",19392.53,22706,12813.18,{"$f":"G62+G63","v":19498.419999999998},0,0,12727.19]
[null,null,null,null,null,"Extra-regionale",105.89,null,null,null,null,null,85.99]

{"sheet":"Tab 61bis","index":20,"n_rows":44,"n_cols":3,"rows_kept":44,"cut":false,"hidden":false,"merged":[[42,0,42,1],[39,0,39,1],[2,0,2,2],[6,0,6,1],[8,0,8,1],[16,0,16,1],[18,0,18,1],[34,0,34,1],[36,0,36,1]]}
[]
[null,null,"Tabella 61-bis"]
["Dettaglio acquisti da privato di prestazioni non rientranti nei contratti negoziali \n(Acquisti Diretti)"]
["Struttura privata erogante","Tipologia assistenza/prestazione","Totale prestazione al 31/12/18"]
["SYNERGO CASA DI CURA PRIVATA PIERANGELISRL","Specialistica ambulatoriale",3934.84]
["VILLA SERENA DR.L.PETRUZZI S.R.L.","Specialistica ambulatoriale ",10413.32]
["CONTO 0702010313 - Servizi sanitari da case di cura private - per cittadini residenti acquistate fuori contratti negoziali in strutture entro Regione (Assistenza Specialistica Ambulatoriale)",null,{"$f":"SUM(C5:C6)","v":14348.16}]
["LIFECARE S.R.L.","Specialistica ambulatoriale",5004]
["CONTO 0702010321 - Servizi sanitari da altri soggetti privati - per cittadini residenti acquistate fuori contratti negoziali in strutture entro Regione (Assistenza Specialistica Ambulatoriale)",null,{"$f":"SUM(C8)","v":5004}]
["LEGA DEL FILO D'ORO","Riabilitazione ex art. 26",22849.32]
["OPERA PIA ESSA G.MANCINELLIMONTELPARO","Riabilitazione ex art. 26",81485.98]
["KOS CARE S.R.L.(EX IST. RIAB. SANTO STEFANO)","Riabilitazione ex art. 26",80518.75]
["COOP. LUCE SUL MARE SOC. COOP.SOCIALECENTRO DI RIABILITAZIONE PRIVATO","Riabilitazione ex art. 26",61152]
["IST. DI RIAB. C.A.R.S.I.C.","Riabilitazione ex art. 26",51688]
["UNIVERSO SALUTE S.R.L.","Riabilitazione ex art. 26",238943.43]
["CENTRO RIABILITAZIONE MOTORIA PADRE PIO","Riabilitazione ex art. 26",8847.4]
["CONTO 0702010408 - Da privato accreditato per cittadini residenti acquistate in strutture fuori Regione (Riabilitazione ex art. 26)",null,{"$f":"SUM(C10:C16)","v":545484.88}]
["CONSORZIO COOPERATIVE SOCIALI S.G.S.","Assistenza psichiatrica",822496.13]
["CONTO 0702010807 - Da privato accreditato per cittadini residenti acquistate fuori contratti negoziali in strutture entro Regione (Strutture Psicoriabilitative) (intraregionale)",null,{"$f":"SUM(C18)","v":822496.13}]
["INVESTIMENTI CERESIO","Assistenza psichiatrica",5859]
["GNOSIS S.C.R.L.","Assistenza psichiatrica",60782.03]
["COOPERATIVA ARL RAYMOND GLEDHILL ONLUS","Assistenza psichiatrica",34133.4]
["IL PORTO - ONLUS ASSOCIAZIONE","Assistenza psichiatrica",50142.96]
["GESTI-VAR SRL","Assistenza psichiatrica",8002]
["SOGEPI S.R.L.","Assistenza psichiatrica",87823.2]
["LA GOCCIA SOC.COOP.SOCIALE","Assistenza psichiatrica",218448.67]
["SERENITY HOUSE EAGLES SRLCASA DI RIPOSO-CASA PROTETTA-","Assistenza psichiatrica",81760]
["ATENA SRL","Assistenza psichiatrica",545760.80000000005]
["ITALIAN HOSPITAL GROUP","Assistenza psichiatrica",46678.2]
["SUORE OSPEDALIERE","Assistenza psichiatrica",25160]
["ABITARE IL TEMPO SRL","Assistenza psichiatrica",1750]
["SERENI ORIZZONTI SPA","Assistenza psichiatrica",372363.3]
["FONDAZIONE GRUBER ONLUS","Assistenza psichiatrica",20971.400000000001]
["COOPERATIVA SOC.TRAGITTI SOC.COOP.ONLUS","Assistenza psichiatrica",30250.5]
["CONTO 0702010809 - Da privato accreditato per cittadini residenti acquistate in strutture fuori Regione (Strutture Psicoriabilitative) (extraregionale)",null,{"$f":"SUM(C20:C34)","v":1589885.46}]
["DIAVERUM ITALIA SRL","Assistenza geriatrica",693177.29]
["CONTO 0702011225 - Altre prestazioni socio sanitarie a rilevanza sanitaria da privato (intraregionale e extraregionale)",null,{"$f":"SUM(C36)","v":693177.29}]
["A.S.P. PAOLO RICCI AZ.PUBBLICA DI SERVIZ","Assistenza geriatrica",19158.8]
["A.N.F.F.A.S. ONLUS CONERO","Assistenza geriatrica",38363.89]
["CONTO 0702011226 - Da privato accreditato per assistenza geriatrica per cittadini residenti acquistate in strutture fuori Regione (Centri Residenziali)",null,{"$f":"SUM(C38:C39)","v":57522.69}]
["OPERA PIA ESSA G.MANCINELLIMONTELPARO","Assistenza geriatrica",20630]
["CONGREG.PICCOLE SUORE MISSIONARIE DELLACARITA' PICCOLO COTTOLENGO DI DON ORIONE","Assistenza geriatrica",36198]
["CONTO 0702011227 - Da privato accreditato per assistenza geriatrica per cittadini residenti acquistate in strutture fuori Regione (Residenze Sanitarie Assistite)",null,{"$f":"SUM(C41:C42)","v":56828}]
["TOTALE GENERALE",null,{"$f":"C7+C9+C17+C19+C35+C37+C40+C43","v":3784746.61}]

{"sheet":"AS03","index":21,"n_rows":91,"n_cols":6,"rows_kept":91,"cut":false,"hidden":false,"merged":[[17,1,17,3],[25,2,25,3],[34,2,34,3],[35,2,35,3],[80,2,80,3],[45,2,45,3],[56,2,56,3],[57,2,57,3],[68,2,68,3],[58,2,58,3],[62,2,62,3],[63,2,63,3],[64,2,64,3],[36,2,36,3],[37,2,37,3],[46,2,46,3],[74,2,74,3],[75,2,75,3],[77,2,77,3],[78,2,78,3],[65,2,65,3],[69,2,69,3],[66,2,66,3],[67,2,67,3],[59,2,59,3],[60,2,60,3],[61,2,61,3],[73,2,73,3],[70,2,70,3],[71,2,71,3],[72,2,72,3],[53,2,53,3],[54,2,54,3],[55,2,55,3],[41,2,41,3],[51,2,51,3],[47,2,47,3],[48,2,48,3],[49,2,49,3],[50,2,50,3],[52,2,52,3],[38,2,38,3],[39,2,39,3],[40,2,40,3],[10,2,10,3],[12,2,12,3],[19,2,19,3],[16,2,16,3],[14,2,14,3],[29,2,29,3],[18,2,18,3],[20,2,20,3],[21,2,21,3],[23,2,23,3],[31,2,31,3],[32,2,32,3],[33,2,33,3],[0,0,0,6],[2,1,2,4],[4,2,4,3],[7,2,7,3],[9,2,9,3],[5,2,5,3],[6,1,6,3],[6,5,6,6],[89,0,89,6],[90,0,90,6],[8,1,8,3],[11,1,11,3],[13,1,13,3],[15,1,15,3],[24,2,24,3],[26,2,26,3],[28,2,28,3],[30,2,30,3],[76,1,76,3],[42,2,42,3],[43,2,43,3],[44,2,44,3],[22,2,22,3],[27,2,27,3],[79,1,79,3],[82,1,82,3],[83,0,83,3],[87,0,87,6],[88,0,88,6],[81,2,81,3]]}
["AS03 - Consulenze, Collaborazioni, Interinale e altre prestazioni di lavoro sanitarie e sociosanitarie"]
[]
["AS03 - SI","Nell'esercizio sono stati rilevati costi per consulenze, collaborazioni, interinale e altre prestazioni di lavoro sanitarie e sociosanitarie. Si veda dettaglio sottostante per tipologia di prestazione, soggetto fornitore e importo."]
[]
["Cod. Conto","Descrizione","Fornitore",null,"Importo"]
["0702011503","Consulenze sanitarie da privato - articolo 55, comma 2, CCNL 8 giugno 2000","PERSONALE  - VARIE QUALIFICHE",null,2164804.17]
["0702011503","Consulenze sanitarie da privato - articolo 55, comma 2, CCNL 8 giugno 2000",null,null,{"$f":"SUM(E6)","v":2164804.17},"IMPORTO DETTAGLIATO ALLA TABELLA 60-bis"]
["0702011504","Altre consulenze sanitarie e sociosanitarie da privato","MEDICI SPECIALISTICI AMBULATORIALI INTERNI",null,864.76]
["0702011504","Altre consulenze sanitarie e sociosanitarie da privato",null,null,{"$f":"SUM(E8)","v":864.76}]
["0702011505","Consulenze sanitarie e sociosanitarie da privato","SANTURBANO VALERIANO",null,2159.62]
["0702011505","Consulenze sanitarie e sociosanitarie da privato","SANTONE CELESTE","DE CINQUE GIUSEPPE",1357.33]
["0702011505","Totale consulenze sanitarie e sociosanitarie da privato",null,null,{"$f":"SUM(E10:E11)","v":3516.95}]
["0702011510","Indennità a personale universitario - area sanitaria","Università G. d'Annunzio di Chieti",null,256736.03]
["0702011510","Totale Indennità a personale universitario - area sanitaria",null,null,{"$f":"SUM(E13)","v":256736.03}]
["0702011511","Lavoro interinale - area sanitaria","MANPOWER SRL",null,2862789.15]
["0702011511","Totale lavoro interinale - area sanitaria",null,null,{"$f":"SUM(E15)","v":2862789.15}]
["0702011515","Altre collaborazioni e prestazioni di lavoro - area sanitaria","MEDICI SPECIAL AMBULATORIALI INTERNI TIT",null,86.13]
["0702011515","Totale Altre collaborazioni e prestazioni di lavoro - area sanitaria",null,null,{"$f":"SUM(E17)","v":86.13}]
["0702011516","Personale tirocinante compresi oneri riflessi","MORETTA SILVIA",null,900]
["0702011516","Personale tirocinante compresi oneri riflessi","CECI LORENZO",null,900]
["0702011516","Personale tirocinante compresi oneri riflessi","PALUMBO CARLO",null,900]
["0702011516","Personale tirocinante compresi oneri riflessi","LEPORATI LUCA",null,1200]
["0702011516","Personale tirocinante compresi oneri riflessi","INAIL PESCARA",null,395.41]
["0702011516",null,"Totale personale tirocinante compresi oneri riflessi",null,{"$f":"SUM(E19:E23)","v":4295.41}]
["0702011517","Borsisti compresi oneri riflessi","DI CENSO ERICA",null,16250.8]
["0702011517","Borsisti compresi oneri riflessi","TARABORRELLI MERILDA",null,20648.03]
["0702011517","Borsisti compresi oneri riflessi","FANTASIA DONATELLA",null,8475.52]
["0702011517","Borsisti compresi oneri riflessi","SCIACCA ANTONINA",null,11382.11]
["0702011517","Borsisti compresi oneri riflessi","MARANI TORO PATRIZIA",null,11471.08]
["0702011517","Borsisti compresi oneri riflessi","BRATTELLI ANTONELLO",null,23905.41]
["0702011517","Borsisti compresi oneri riflessi","SORGENTONE SIMONA",null,5068.47]
["0702011517","Borsisti compresi oneri riflessi","RANUCCI ELENA",null,11930.26]
["0702011517","Borsisti compresi oneri riflessi","TARICANI STEFANO",null,6591.92]
["0702011517","Borsisti compresi oneri riflessi","ZACCAGNINI ALEXIA",null,14760.15]
["0702011517","Borsisti compresi oneri riflessi","PERSICO ALESSIA",null,3569.91]
["0702011517","Borsisti compresi oneri riflessi","D'ALOISIO MARIANNA",null,9177.33]
["0702011517","Borsisti compresi oneri riflessi","DELL'ORLETTA ELEONORA",null,15941.1]
["0702011517","Borsisti compresi oneri riflessi","PASCALE SILVIA",null,9176.43]
["0702011517","Borsisti compresi oneri riflessi","VITULLO FELICE",null,27530.3]
["0702011517","Borsisti compresi oneri riflessi","LUCIANI STEFANIA",null,21245.78]
["0702011517","Borsisti compresi oneri riflessi","SBARAGLIA VALENTINA",null,13658.56]
["0702011517","Borsisti compresi oneri riflessi","DE THOMASIS VALENTINA",null,12977.06]
["0702011517","Borsisti compresi oneri riflessi","ANTONUCCI MARIANGELA",null,2845.75]
["0702011517","Borsisti compresi oneri riflessi","SCIARRA PIERPAOLA",null,2752.9]
["0702011517","Borsisti compresi oneri riflessi","MIRRA NOEMI",null,1307.1600000000001]
["0702011517","Borsisti compresi oneri riflessi","D'ADDARIO DORA",null,4129.9399999999996]
["0702011517","Borsisti compresi oneri riflessi","ESPOSITO ANNALISA",null,8503.66]
["0702011517","Borsisti compresi oneri riflessi","PERROTTA ELEONORA",null,13658.21]
["0702011517","Borsisti compresi oneri riflessi","PETACCIA VALENTINA",null,13657.89]
["0702011517","Borsisti compresi oneri riflessi","DONATO SIMONE",null,15521.21]
["0702011517","Borsisti compresi oneri riflessi","CAPORALE MARTA",null,11471.02]
["0702011517","Borsisti compresi oneri riflessi","ZARA FEDERICA",null,4015.05]
["0702011517","Borsisti compresi oneri riflessi","D'ALESSANDRO MASSIMO",null,16518.080000000002]
["0702011517","Borsisti compresi oneri riflessi","DI CARLO SIMONA",null,12899.2]
["0702011517","Borsisti compresi oneri riflessi","AMICANTONIO ALESSANDRA",null,12899.67]
["0702011517","Borsisti compresi oneri riflessi","DI NICOLA LORELLA",null,16549.02]
["0702011517","Borsisti compresi oneri riflessi","LAURITA FILOMENA",null,1307.07]
["0702011517","Borsisti compresi oneri riflessi","LO STERZO ROSA",null,13765.52]
["0702011517","Borsisti compresi oneri riflessi","PELINO LAURA",null,20188.75]
["0702011517","Borsisti compresi oneri riflessi","CUCCHIARELLI SILVIA",null,10323.9]
["0702011517","Borsisti compresi oneri riflessi","DI LISO ELISABETTA",null,3135.34]
["0702011517","Borsisti compresi oneri riflessi","RANALLI PAOLA",null,7953.25]
["0702011517","Borsisti compresi oneri riflessi","MASCIA MANLIO",null,19765.72]
["0702011517","Borsisti compresi oneri riflessi","IANNELLI TIZIANA",null,23374.89]
["0702011517","Borsisti compresi oneri riflessi","CLEMENTE KATIA",null,12328.22]
["0702011517","Borsisti compresi oneri riflessi","RINCHI ALICE",null,11012.14]
["0702011517","Borsisti compresi oneri riflessi","SANTONE CELESTE",null,21246.639999999999]
["0702011517","Borsisti compresi oneri riflessi","NARDI IRENE",null,9010.23]
["0702011517","Borsisti compresi oneri riflessi","DI GIAMBATTISTA MONICA",null,15830.47]
["0702011517","Borsisti compresi oneri riflessi","TRAVAGLINI MARIA MADDALENA",null,7571.79]
["0702011517","Borsisti compresi oneri riflessi","SASSO ELENA",null,15830.47]
["0702011517","Borsisti compresi oneri riflessi","DRAGANI MARIA GRAZIA ANIA",null,13089.32]
["0702011517","Borsisti compresi oneri riflessi","DI BERARDINO ALESSANDRA",null,6509.98]
["0702011517","Borsisti compresi oneri riflessi","MINISTERO DELLE FINANZE",null,1646.61]
["0702011517","Borsisti compresi oneri riflessi","I.N.P.S. ",null,62805.75]
["0702011517","Borsisti compresi oneri riflessi","IRAP",null,47773.03]
["0702011517","Borsisti compresi oneri riflessi",null,null,{"$f":"SUM(E25:E76)","v":704958.07000000007}]
["0702011518","Personale religioso adibito a mansioni umanitarie","BENEFICIARI DIVERSI PERSONALE DIPENDENTE",null,31891.62]
["0702011518","Personale religioso adibito a mansioni umanitarie","MINISTERO DELLE FINANZE",24055.460000000003,2573.7199999999998]
["0702011518","Personale religioso adibito a mansioni umanitarie",null,null,{"$f":"SUM(E78:E79)","v":34465.339999999997}]
["0702011519","Medicina penitenziaria","MEDICI ADDETTI ALLA GUARDIA MEDICA FESTIVA",null,70142.58]
["0702011519","Medicina penitenziaria","DODI IDA MADDALENA",null,1819.23]
["0702011519","Totale Medicina penitenziaria",null,null,{"$f":"SUM(E81:E82)","v":71961.81}]
["VOCE BA 1380 - TOTALE CONSULENZE, COLLABORAZIONI, INTERINALE, ALTRE PRESTAZIONI DI LAVORO SANITARIE E SOCIO-SANITARIE DA PRIVATO",null,null,null,{"$f":"E7+E9+E12+E14+E16+E18+E24+E77+E80+E83","v":6104477.8199999994}]
[]
[]
[]
["La voce di CE BA1380 \"Consulenze , collaborazioni, interinale e altre prestazioni di lavoro sanitarie e sociosanitarie da privato\" ammonta, al 31/12/2018, ad €/000 6.104 ed è diminuita, rispetto al 2017, di circa - €/000 286. Tale variazione è stata determinata:"]
["- dalla riduzione dei costi per consulenze sanitarie da privato ex art. 55, comma 2, CCNL 8 giugno 2000, per €/000 - 207, a cui l'Azienda fa ricorso per fronteggiare le urgenze o per potenziare alcuni servizi sanitari;"]
["- dall'incremento dei costi per lavoro interinale (€/000 + 254), in parte finanziati con fondi da Progetti Obiettivo, dovuti al fatto che l'Azienda nel 2018 ha fatto maggiore ricorso a tale tipologia di contratto di lavoro rispetto al 2017;"]
["- dalla riduzione dei costi per borsisti (- €/000 319), dovuta al fatto che l'Azienda nel 2018 ha fatto minore ricorso a tale tipologia di rapporto rispetto al 2017 soprattutto per la realizzazione dei progetti obiettivo, privilegiando altre tipologie contrattuali."]

{"sheet":"AS04","index":22,"n_rows":67,"n_cols":4,"rows_kept":67,"cut":false,"hidden":false,"merged":[[41,1,41,2],[44,1,44,2],[6,1,6,2],[0,0,0,3],[66,0,66,3],[2,1,2,3],[11,0,11,3],[7,1,7,2],[62,1,62,2],[63,0,63,2],[64,0,64,2],[45,0,45,2],[50,1,50,2],[51,0,51,2],[8,1,8,2],[9,0,9,2],[20,1,20,2]]}
["AS04 - Consulenze, Collaborazioni, Interinale e altre prestazioni di lavoro non sanitarie"]
[]
["AS04 - SI","Nell'esercizio sono stati rilevati costi per consulenze, collaborazioni, interinale e altre prestazioni di lavoro non sanitarie. Si veda dettaglio sottostante per tipologia prestazione, soggetto fornitore e importo."]
[]
[{"$f":"\"Dettaglio composizione voce BA1790 \nConsulenze non sanitarie da privato \"&\n [1]Intro!B7","v":"Dettaglio composizione voce BA1790 \nConsulenze non sanitarie da privato Dott.ssa FACCIA FEDERICA"}]
["TIPOLOGIA","DURATA CONTRATTO","DECORRENZA","IMPORTO AL 31/12/2018"]
["Consulenze tecniche","Incarico professionale a prestazione unica",null,70269.509999999995]
["Consulenze legali","Incarico professionale a prestazione unica",null,327809.81]
["Altre consulenze","Incarico professionale a prestazione unica",null,34447.33]
["Totale voce BA1790  al 31/12/2018",null,null,{"$f":"SUM(D7:D9)","v":432526.65}]
[]
["DETTAGLIO VOCE CE BA1780 - \"CONSULENZE, COLLABORAZIONI, INTERINALE E ALTRE PRESTAZIONI DI LAVORO NON SANITARIE DA PRIVATO\""]
[]
["Cod. Conto","Descrizione","Fornitore","Importo"]
["0702020204","Consulenze tecniche","CHIOLA CARLA",16330.97]
["0702020204","Consulenze tecniche","AGENZIA DELLE ENTRATE - PESCARA",1988.1]
["0702020204","Consulenze tecniche","ST.INGEGNERIA BAGAGLI ANDREA",19769.66]
["0702020204","Consulenze tecniche","EMMECI' STUDIO CACCIALUPI MARCELLO",15206.42]
["0702020204","Consulenze tecniche","MARRELLI ALFONSO",250]
["0702020204","Consulenze tecniche","DE GREGORIO LUCIANO",16724.36]
["0702020204","Totale consulenze tecniche",null,{"$f":"SUM(D15:D20)","v":70269.509999999995}]
["0702020205","Consulenze legali","CERCEO GIULIO STUDIO LEGALE",6496.31]
["0702020205","Consulenze legali","RUSSI AVV. DOMENICO",10418.36]
["0702020205","Consulenze legali","STUDIO LEGALE AVV.TI TENAGLIA",7745.55]
["0702020205","Consulenze legali","CIOFANI CARMINE",3044.74]
["0702020205","Consulenze legali","MARCHESE TOMMASO",173663.93]
["0702020205","Consulenze legali","DEL PIZZO ANTONIO CARMINE",8905.06]
["0702020205","Consulenze legali","MODESTI ANDREA",5455.13]
["0702020205","Consulenze legali","ANGIOLELLI DANTE AVV.",33895.360000000001]
["0702020205","Consulenze legali","ALESSANDRINI PIETRO",1605.03]
["0702020205","Consulenze legali","MANGIA GIOVANNI AVV.",27723.279999999999]
["0702020205","Consulenze legali","ANTONUCCI VINCENZO AVV.",11239.62]
["0702020205","Consulenze legali","LUPO TIMINI LORENZO",729.56]
["0702020205","Consulenze legali","FAIETA ANTONELLA",3159.7]
["0702020205","Consulenze legali","DELLA ROCCA SERGIO",6417.33]
["0702020205","Consulenze legali","GENTILINI FEDERICO",9998.66]
["0702020205","Consulenze legali","PACE FEDERICO",1094.3399999999999]
["0702020205","Consulenze legali","CAMILLI SIMONA",881]
["0702020205","Consulenze legali","MUNDO CARLA",4902.6400000000003]
["0702020205","Consulenze legali","RIEZZO IRENE",2821.41]
["0702020205","Consulenze legali","STS BALIETTI E CESARONEASSOCIAZIONE PROFESSIONALE",7612.8]
["0702020205","Totale consulenze legali",null,{"$f":"SUM(D22:D41)","v":327809.81}]
["0702020206","Altre consulenze","EBMT EUROPEAN GROUP FOR BLOOD AND MARROW",20252]
["0702020206","Altre consulenze","NEMESI SOCIETA' COOPERATIVA",14195.33]
["0702020206","Totale altre consulenze",null,{"$f":"SUM(D43:D44)","v":34447.33}]
["TOTALE CONSULENZE NON SANITARIE DA PRIVATO (Voce BA1790) ",null,null,{"$f":"D21+D42+D45","v":432526.65}]
["0702020215","Collaborazioni coordinate e continuative non sanitarie da privato - ruolo amministrativo","BACI RICCARDO",8608.83]
["0702020215","Collaborazioni coordinate e continuative non sanitarie da privato - ruolo amministrativo","BALDASSARRE IPPOLITO",8479.91]
["0702020215","Collaborazioni coordinate e continuative non sanitarie da privato - ruolo amministrativo","MANZOLI LAMBERTO",6978.91]
["0702020215","Collaborazioni coordinate e continuative non sanitarie da privato - ruolo amministrativo","INPS",7110.69]
["0702020215","Collaborazioni coordinate e continuative non sanitarie da privato - ruolo amministrativo",null,{"$f":"SUM(D47:D50)","v":31178.339999999997}]
["TOTALE COLLABORAZIONI COORDINATE E CONTINUATIVE NON SANITARIE DA PRIVATO (Voce BA1800)",null,null,{"$f":"D51","v":31178.339999999997}]
["0702020223","Personale religioso adibito a mansioni non sanitarie","PROBI MARIO",22869.46]
["0702020223","Personale religioso adibito a mansioni non sanitarie","CURIA METROPOLITANA PESCARA-PENNE",6000]
["0702020223","Personale religioso adibito a mansioni non sanitarie","SEDOGO WENDE GOUDA ALBERT",17099.75]
["0702020223","Personale religioso adibito a mansioni non sanitarie","LIBAKATA BOIKANI",17099.52]
["0702020223","Personale religioso adibito a mansioni non sanitarie","DIOCESI SULMONA-VALVA",3300]
["0702020223","Personale religioso adibito a mansioni non sanitarie","MANDELLI GIANCARLO",22869.87]
["0702020223","Personale religioso adibito a mansioni non sanitarie","KAFANDO RELBAMBA ROGER",5769.1]
["0702020223","Personale religioso adibito a mansioni non sanitarie","YELYAORE RELEWENDE LAZARE",5769.1]
["0702020223","Personale religioso adibito a mansioni non sanitarie","INPS",20661.23]
["0702020223","Personale religioso adibito a mansioni non sanitarie","IRAP",6859.38]
["0702020223","Totale personale religioso adibito a mansioni non sanitarie",null,{"$f":"SUM(D53:D62)","v":128297.41}]
["ALTRE COLLABORAZIONI E PRESTAZIONI DI LAVORO - AREA NON SANITARIA (Voce BA1830)",null,null,{"$f":"D63","v":128297.41}]
["VOCE BA 1780 - TOTALE CONSULENZE, COLLABORAZIONI, INTERINALE E ALTRE PRESTAZIONI DI LAVORO NON SANITARIE DA PRIVATO",null,null,{"$f":"D46+D52+D64","v":592002.4}]
[]
["La voce di CE BA1780 \"Consulenze , collaborazioni, interinale e altre prestazioni di lavoro non sanitarie da privato\" ammonta, al 31/12/2018, ad €/000 592 e si è ridotta, rispetto al 2017, di circa €/000 58. Tale scostamento è dovuto principalmente alla riduzione dei costi per consulenze legali (- €/000 154), il cui ammontare può subire alcune variazioni, da un anno all'altro, in relazione al numero ed all'esito dei contenziosi conclusi nel corso dell'esercizio. Tale decremento di spesa è stato parzialmente compensato da lievi incrementi di costi relativi ad altre tipologie di consulenze non sanitarie, in particolare: l'aumento dei costi per consulenze tecniche (+ €/000 33), per collaborazioni coordinate e continuative da privato di tipo amministrativo (+ €/000 17), per altre consulenze (+ €/000 34) e del costo per personale religioso adibito a mansioni non sanitarie (+ €/000 11). "]

{"sheet":"Tab 62","index":23,"n_rows":59,"n_cols":6,"rows_kept":59,"cut":false,"hidden":false,"merged":[[56,0,56,5],[57,0,57,5],[58,0,58,5],[1,5,2,5],[0,1,0,5],[1,0,2,0],[1,1,2,1],[1,2,2,2],[1,3,2,3],[1,4,2,4]]}
[null,"Tab. 62 – Dettaglio acquisti di servizi non sanitari "]
["CODICE MOD. CE","DETTAGLIO ACQUISTI DI SERVIZI NON SANITARI",{"$f":"\"Valore CE \" &'00 Aggregatore'!$F$2","v":"Valore CE 2018"},{"$f":"\"Valore CE \" &'00 Aggregatore'!$F$2 -1","v":"Valore CE 2017"},"Variazioni\nimporto","%"]
[]
[null,"SERVIZI NON SANITARI",{"$f":"SUM(C5:C18)","v":35624428.469999999},{"$f":"SUM(D5:D18)","v":35538780.359999992},{"$f":"C4-D4","v":85648.110000006855},{"$f":"IF(AND(C4=0,D4=0),0,IF(C4=0,\"\",IF(D4=0,\"\",E4/D4)))","v":2.4099901328185837E-3}]
["BA1580","Lavanderia",{"$f":"SUMIF('00 CE'!$B:$B,'Tab 62'!$A5,'00 CE'!G:G)","v":4633285.6399999997},{"$f":"SUMIF('00 CE'!$B:$B,'Tab 62'!$A5,'00 CE'!F:F)","v":5274953.32},{"$f":"C5-D5","v":-641667.68000000063},{"$f":"IF(AND(C5=0,D5=0),0,IF(C5=0,\"\",IF(D5=0,\"\",E5/D5)))","v":-0.1216442385503424}]
["BA1590","Pulizia",{"$f":"SUMIF('00 CE'!$B:$B,'Tab 62'!$A6,'00 CE'!G:G)","v":6110953.9000000004},{"$f":"SUMIF('00 CE'!$B:$B,'Tab 62'!$A6,'00 CE'!F:F)","v":6089443.3399999999},{"$f":"C6-D6","v":21510.560000000522},3.5324345426950834E-3]
["BA1600","Mensa",{"$f":"SUMIF('00 CE'!$B:$B,'Tab 62'!$A7,'00 CE'!G:G)","v":4253494.91},{"$f":"SUMIF('00 CE'!$B:$B,'Tab 62'!$A7,'00 CE'!F:F)","v":4117793.49},135701.41999999993,3.2954887205866146E-2]
["BA1610","Riscaldamento",{"$f":"SUMIF('00 CE'!$B:$B,'Tab 62'!$A8,'00 CE'!G:G)","v":912590.81},{"$f":"SUMIF('00 CE'!$B:$B,'Tab 62'!$A8,'00 CE'!F:F)","v":1064233.96},-151643.14999999991,-0.14249042569549267]
["BA1620","Servizi di assistenza informatica",{"$f":"SUMIF('00 CE'!$B:$B,'Tab 62'!$A9,'00 CE'!G:G)","v":1812783.81},{"$f":"SUMIF('00 CE'!$B:$B,'Tab 62'!$A9,'00 CE'!F:F)","v":1666759.65},146024.16000000015,8.7609608259955271E-2]
["BA1630","Servizi trasporti (non sanitari)",{"$f":"SUMIF('00 CE'!$B:$B,'Tab 62'!$A10,'00 CE'!G:G)","v":5892.6},{"$f":"SUMIF('00 CE'!$B:$B,'Tab 62'!$A10,'00 CE'!F:F)","v":9272},-3379.3999999999996,-0.36447368421052628]
["BA1640","Smaltimento rifiuti",{"$f":"SUMIF('00 CE'!$B:$B,'Tab 62'!$A11,'00 CE'!G:G)","v":1392025.82},{"$f":"SUMIF('00 CE'!$B:$B,'Tab 62'!$A11,'00 CE'!F:F)","v":1384638.6300000001},7387.1899999999441,5.3351032102866751E-3]
["BA1650","Utenze telefoniche",{"$f":"SUMIF('00 CE'!$B:$B,'Tab 62'!$A12,'00 CE'!G:G)","v":940270.67},{"$f":"SUMIF('00 CE'!$B:$B,'Tab 62'!$A12,'00 CE'!F:F)","v":524835.69999999995},415434.97000000009,0.79155242297732442]
["BA1660","Utenze elettricità",{"$f":"SUMIF('00 CE'!$B:$B,'Tab 62'!$A13,'00 CE'!G:G)","v":3337366.78},{"$f":"SUMIF('00 CE'!$B:$B,'Tab 62'!$A13,'00 CE'!F:F)","v":3156167.9},181198.87999999989,5.7411039507752393E-2]
["BA1670","Altre utenze",{"$f":"SUMIF('00 CE'!$B:$B,'Tab 62'!$A14,'00 CE'!G:G)","v":875740.52},{"$f":"SUMIF('00 CE'!$B:$B,'Tab 62'!$A14,'00 CE'!F:F)","v":705877.73},169862.79000000004,0.24064052849492792]
["BA1680","Premi di assicurazione",{"$f":"SUMIF('00 CE'!$B:$B,'Tab 62'!$A15,'00 CE'!G:G)","v":4728617.0999999996},{"$f":"SUMIF('00 CE'!$B:$B,'Tab 62'!$A15,'00 CE'!F:F)","v":4810016.04},-81398.94000000041,-1.692280011606789E-2]
["BA1720","Altri servizi non sanitari da pubblico (Aziende sanitarie pubbliche della Regione)",{"$f":"SUMIF('00 CE'!$B:$B,'Tab 62'!$A16,'00 CE'!G:G)","v":0},{"$f":"SUMIF('00 CE'!$B:$B,'Tab 62'!$A16,'00 CE'!F:F)","v":0},0,0]
["BA1730","Altri servizi non sanitari da altri soggetti pubblici",{"$f":"SUMIF('00 CE'!$B:$B,'Tab 62'!$A17,'00 CE'!G:G)","v":0},{"$f":"SUMIF('00 CE'!$B:$B,'Tab 62'!$A17,'00 CE'!F:F)","v":0},0,0]
["BA1740","Altri servizi non sanitari da privato",{"$f":"SUMIF('00 CE'!$B:$B,'Tab 62'!$A18,'00 CE'!G:G)","v":6621405.9100000001},{"$f":"SUMIF('00 CE'!$B:$B,'Tab 62'!$A18,'00 CE'!F:F)","v":6734788.6000000006},-113382.69000000041,-1.6835374758459441E-2]
["0702020118","Vigilanza",1895343.19,1862266.45,33076.739999999991,1.7761550716869755E-2]
["0702020119","Altri servizi appaltati",4138097.74,4379343.09,-241245.34999999963,-5.508710896638145E-2]
["0702020120","Spese di rappresentanza",181,949,-768,-0.80927291886195996]
["0702020121","Spese postali",354747.32,251509.11,103238.21000000002,0.41047503209724701]
["0702020122","Quote per spese condominiali",32959.089999999997,21247.49,11711.599999999995,0.55119922400245835]
["0702020123","Spese legali",77880.800000000003,85408.79,-7527.9899999999907,-8.8140693715482818E-2]
["0702020124","Bolli e marchi",55127.95,58649.21,-3521.260000000002,-6.0039342388414137E-2]
["0702020125","Abbonamenti, riviste e libri",21856.82,37522.53,-15665.71,-0.41750143180643734]
["0702020126","Spese per liti, arbitraggi e risarcimenti",72,0,72,""]
["0702020127","Altri servizi non sanitari da privato",45140,37851.33,7288.6699999999983,0.19256047277598959]
["0702020128","Rimborsi spese personale del ruolo sanitario dirigenza medica",0,0,0,0]
["0702020129","Rimborsi spese personale del ruolo sanitario dirigenza non medica",0,0,0,0]
["0702020130","Rimborsi spese personale del ruolo sanitario comparto",0,41.6,-41.6,""]
["0702020131","Rimborsi spese personale del ruolo professionale dirigenza",0,0,0,0]
["0702020132","Rimborsi spese personale del ruolo professionale comparto",0,0,0,0]
["0702020133","Rimborsi spese personale del ruolo tecnico dirigenza",0,0,0,0]
["0702020134","Rimborsi spese personale del ruolo tecnico comparto",0,0,0,0]
["0702020135","Rimborsi spese personale del ruolo amministrativo dirigenza",0,0,0,0]
["0702020136","Rimborsi spese personale del ruolo amministrativo comparto",0,0,0,0]
[null,"CONSULENZE, COLLABORAZIONI, INTERINALE, ALTRE PRESTAZIONI DI LAVORO NON SANITARIE ",{"$f":"SUM(C39:C41)","v":592002.4},{"$f":"SUM(D39:D41)","v":649624.89999999991},-57622.499999999884,-8.8701187408302684E-2]
["BA1760","Consulenze non sanitarie da Aziende sanitarie pubbliche della Regione",{"$f":"SUMIF('00 CE'!$B:$B,'Tab 62'!$A39,'00 CE'!G:G)","v":0},{"$f":"SUMIF('00 CE'!$B:$B,'Tab 62'!$A39,'00 CE'!F:F)","v":0},{"$f":"C39-D39","v":0},0]
["BA1770","Consulenze non sanitarie da Terzi - Altri soggetti pubblici",{"$f":"SUMIF('00 CE'!$B:$B,'Tab 62'!$A40,'00 CE'!G:G)","v":0},{"$f":"SUMIF('00 CE'!$B:$B,'Tab 62'!$A40,'00 CE'!F:F)","v":0},{"$f":"C40-D40","v":0},0]
["BA1780","Consulenze, Collaborazioni, Interinale e altre prestazioni di lavoro non sanitarie da privato",{"$f":"SUMIF('00 CE'!$B:$B,'Tab 62'!$A41,'00 CE'!G:G)","v":592002.4},{"$f":"SUMIF('00 CE'!$B:$B,'Tab 62'!$A41,'00 CE'!F:F)","v":649624.89999999991},-57622.499999999884,-8.8701187408302684E-2]
["BA1790","Consulenze non sanitarie da privato",{"$f":"SUMIF('00 CE'!$B:$B,'Tab 62'!$A42,'00 CE'!G:G)","v":432526.65},{"$f":"SUMIF('00 CE'!$B:$B,'Tab 62'!$A42,'00 CE'!F:F)","v":518707.44999999995},-86180.79999999993,-0.16614529056792984]
["BA1800","Collaborazioni coordinate e continuative non sanitarie da privato",{"$f":"SUMIF('00 CE'!$B:$B,'Tab 62'!$A43,'00 CE'!G:G)","v":31178.34},{"$f":"SUMIF('00 CE'!$B:$B,'Tab 62'!$A43,'00 CE'!F:F)","v":13535.39},17642.95,1.303468167522325]
["BA1810","Indennità a personale universitario - area non sanitaria ",{"$f":"SUMIF('00 CE'!$B:$B,'Tab 62'!$A44,'00 CE'!G:G)","v":0},{"$f":"SUMIF('00 CE'!$B:$B,'Tab 62'!$A44,'00 CE'!F:F)","v":0},0,0]
["BA1820","Lavoro interinale - area non sanitaria ",{"$f":"SUMIF('00 CE'!$B:$B,'Tab 62'!$A45,'00 CE'!G:G)","v":0},{"$f":"SUMIF('00 CE'!$B:$B,'Tab 62'!$A45,'00 CE'!F:F)","v":0},0,0]
["BA1830","Altre collaborazioni e prestazioni di lavoro - area non sanitaria ",{"$f":"SUMIF('00 CE'!$B:$B,'Tab 62'!$A46,'00 CE'!G:G)","v":128297.41},{"$f":"SUMIF('00 CE'!$B:$B,'Tab 62'!$A46,'00 CE'!F:F)","v":117382.06},10915.350000000006,9.2989933896201901E-2]
["BA1840","Rimborso oneri stipendiali del personale non sanitario in comando",{"$f":"SUMIF('00 CE'!$B:$B,'Tab 62'!$A47,'00 CE'!G:G)","v":0},{"$f":"SUMIF('00 CE'!$B:$B,'Tab 62'!$A47,'00 CE'!F:F)","v":0},0,0]
["BA1850","Rimborso oneri stipendiali personale non sanitario in comando da Aziende sanitarie pubbliche della Regione",{"$f":"SUMIF('00 CE'!$B:$B,'Tab 62'!$A48,'00 CE'!G:G)","v":0},{"$f":"SUMIF('00 CE'!$B:$B,'Tab 62'!$A48,'00 CE'!F:F)","v":0},0,0]
["BA1860","Rimborso oneri stipendiali personale non sanitario in comando da Regione, soggetti pubblici e da Università",{"$f":"SUMIF('00 CE'!$B:$B,'Tab 62'!$A49,'00 CE'!G:G)","v":0},{"$f":"SUMIF('00 CE'!$B:$B,'Tab 62'!$A49,'00 CE'!F:F)","v":0},0,0]
["BA1870","Rimborso oneri stipendiali personale non sanitario in comando da aziende di altre Regioni (Extraregione)",{"$f":"SUMIF('00 CE'!$B:$B,'Tab 62'!$A50,'00 CE'!G:G)","v":0},{"$f":"SUMIF('00 CE'!$B:$B,'Tab 62'!$A50,'00 CE'!F:F)","v":0},0,0]
[null,"FORMAZIONE",{"$f":"C52+C53","v":661265.06999999995},{"$f":"D52+D53","v":597344.22},{"$f":"C51-D51","v":63920.849999999977},0.10700840128661492]
["BA1890","Formazione (esternalizzata e non) da pubblico",{"$f":"SUMIF('00 CE'!$B:$B,'Tab 62'!$A52,'00 CE'!G:G)","v":35012.980000000003},{"$f":"SUMIF('00 CE'!$B:$B,'Tab 62'!$A52,'00 CE'!F:F)","v":81237.64},{"$f":"C52-D52","v":-46224.659999999996},-0.56900545116770995]
["BA1900","Formazione (esternalizzata e non) da privato",{"$f":"SUMIF('00 CE'!$B:$B,'Tab 62'!$A53,'00 CE'!G:G)","v":626252.09},{"$f":"SUMIF('00 CE'!$B:$B,'Tab 62'!$A53,'00 CE'!F:F)","v":516106.58},{"$f":"C53-D53","v":110145.50999999995},0.21341620949688328]
[null,"TOTALE",{"$f":"C4+C38+C51","v":36877695.939999998},{"$f":"D4+D38+D51","v":36785749.479999989},{"$f":"E4+E38+E51","v":91946.460000006948},2.499513026097164E-3]
[]
[]
["Il costo per l'acquisto di servizi non sanitari è rimasto sostanzialmente in linea rispetto al 2017, avendo registrato un lieve incremento di €/000 92. Le variazioni maggiormente significative riguardano:"]
["- La riduzione del costo del servizio di lavanderia, per - €/000 641: detto decremento è dovuto a due fattori. In primo luogo, la rimodulazione  dei prezzi del servizio  di lavanolo in base ai prezzi di riferimento ANAC, più vantaggiosi, adottata a far data dal 01/04/2017, è andata a regime per l'intera annualità 2018. In secondo luogo, nell'esercizio 2018 le ditte componenti l'ATI affidataria del servizio di lavanolo hanno fatturato correttamente le quote di rispettiva competenza, diversamente da quanto avvenuto negli esercizi precedenti."]
["- La variazione descritta al precedente punto è stata più che compensata dall'incremento dei costi per utenze, in particolare dall'aumento dei costi per utenze telefoniche, per €/000 415, dovuto al nuovo contratto per l'affidamento dei servizi di connettività nell'ambito del Sistema Pubblico di Connettività di cui alla delibera n. 1008 del 14/11/2017, per utenze elettricità (+ €/000 181) e per altre utenze (+ €/000 170). "]

{"sheet":"Tab 63","index":24,"n_rows":22,"n_cols":6,"rows_kept":22,"cut":false,"hidden":false,"merged":[[21,0,21,5],[2,0,5,5],[0,0,0,6],[7,1,7,5],[8,0,9,0],[8,1,9,1],[8,2,9,2],[8,3,9,3],[8,4,9,4],[8,5,9,5]]}
["AS05 - Manutenzioni e riparazioni"]
[]
["Sono considerate di carattere ordinario le prestazioni di manutenzione finalizzate al normale mantenimento e riparazione dei cespiti, che non comportano un significativo aumento della produttività o della vita utile del bene. In tal caso i relativi costi sono imputati al conto economico, secondo il principio della competenza economica. Qualora invece le spese per manutenzione comportano un miglioramento del bene e ne producono l'allungamento della vita utile, il miglioramento della produttività o della sicurezza, esse sono considerate di carattere straordinario, ed i costi relativi sono imputati al bene oggetto del servizio e capitalizzati. "]
[]
[]
[]
[]
[null,"Tab. 63 – Dettaglio manutenzioni e riparazioni "]
["CODICE MOD. CE","DETTAGLIO MANUTENZIONI E RIPARAZIONI",{"$f":"\"Valore CE \" &'00 Aggregatore'!$F$2","v":"Valore CE 2018"},{"$f":"\"Valore CE \" &'00 Aggregatore'!$F$2 -1","v":"Valore CE 2017"},"Variazioni \nimporto","%"]
[]
["BA1920","Manutenzione e riparazione ai fabbricati e loro pertinenze",{"$f":"SUMIF('00 CE'!$B:$B,'Tab 63'!$A11,'00 CE'!G:G)","v":8571730.1999999993},{"$f":"SUMIF('00 CE'!$B:$B,'Tab 63'!$A11,'00 CE'!F:F)","v":9244877.5800000001},{"$f":"C11-D11","v":-673147.38000000082},{"$f":"IF(AND(C11=0,D11=0),0,IF(C11=0,\"\",IF(D11=0,\"\",E11/C11)))","v":-7.8531097490679408E-2}]
["BA1930","Manutenzione e riparazione agli impianti e macchinari",{"$f":"SUMIF('00 CE'!$B:$B,'Tab 63'!$A12,'00 CE'!G:G)","v":0},{"$f":"SUMIF('00 CE'!$B:$B,'Tab 63'!$A12,'00 CE'!F:F)","v":0},{"$f":"C12-D12","v":0},{"$f":"IF(AND(C12=0,D12=0),0,IF(C12=0,\"\",IF(D12=0,\"\",E12/C12)))","v":0}]
["BA1940","Manutenzione e riparazione alle attrezzature sanitarie e scientifiche",{"$f":"SUMIF('00 CE'!$B:$B,'Tab 63'!$A13,'00 CE'!G:G)","v":6129147.0499999998},{"$f":"SUMIF('00 CE'!$B:$B,'Tab 63'!$A13,'00 CE'!F:F)","v":5502395.79},626751.25999999978,0.10225750090300081]
["BA1950","Manutenzione e riparazione ai mobili e arredi",{"$f":"SUMIF('00 CE'!$B:$B,'Tab 63'!$A14,'00 CE'!G:G)","v":0},{"$f":"SUMIF('00 CE'!$B:$B,'Tab 63'!$A14,'00 CE'!F:F)","v":0},0,0]
["BA1960","Manutenzione e riparazione agli automezzi",{"$f":"SUMIF('00 CE'!$B:$B,'Tab 63'!$A15,'00 CE'!G:G)","v":125986.4},{"$f":"SUMIF('00 CE'!$B:$B,'Tab 63'!$A15,'00 CE'!F:F)","v":109400.27},16586.12999999999,0.13165016223973375]
["BA1970","Altre manutenzioni e riparazioni",{"$f":"SUMIF('00 CE'!$B:$B,'Tab 63'!$A16,'00 CE'!G:G)","v":883986.33},{"$f":"SUMIF('00 CE'!$B:$B,'Tab 63'!$A16,'00 CE'!F:F)","v":873012.59},10973.739999999991,1.2413924998138818E-2]
["BA1980","Manutenzioni e riparazioni da Aziende sanitarie pubbliche della Regione",{"$f":"SUMIF('00 CE'!$B:$B,'Tab 63'!$A17,'00 CE'!G:G)","v":0},{"$f":"SUMIF('00 CE'!$B:$B,'Tab 63'!$A17,'00 CE'!F:F)","v":0},0,0]
[null,"TOTALE",{"$f":"SUM(C11:C17)","v":15710849.98},{"$f":"SUM(D11:D17)","v":15729686.23},{"$f":"SUM(E11:E17)","v":-18836.250000001062},-1.1989325863323572E-3]
[]
[]
[]
["Il costo per manutenzioni sostenuto nel corso dell'esercizio 2018 ha subito una lieve riduzione rispetto a  quello sostenuto nel 2017 (-19 €/000 ). In particolare, a fronte della riduzione del costo per manutenzioni di fabbricati (- €/000 673), dovuta al fatto che gli inteventi manutentivi sui fabbricati sono stati più cospicui nel 2017 rispetto all'anno 2018, si è registrato un incremento del costo di manutenzione delle attrezzature sanitarie e scientifiche (+ €/000 627), a causa delle maggiori necessità manutentive delle attrezzature avvertite dall'Azienda nel corrente esercizio.   "]

{"sheet":"Tab 64-65","index":25,"n_rows":40,"n_cols":10,"rows_kept":40,"cut":false,"hidden":false,"merged":[[32,8,33,8],[32,9,33,9],[2,0,3,0],[2,1,3,1],[2,2,3,2],[2,3,2,4],[2,5,3,5],[32,3,33,3],[32,4,33,4],[32,5,33,7],[38,5,38,7],[39,5,39,7],[35,5,35,7],[34,5,34,7],[32,1,33,1],[32,2,33,2],[36,5,36,7],[37,5,37,7]]}
[]
[null,"Tab. 64 – Dettaglio costi per contratti multiservizio "]
["CODICE MOD. CE","DETTAGLIO COSTI PER \nCONTRATTI MULTISERVIZIO (GLOBAL SERVICE)",{"$f":"\"Valore CE \" &'00 Aggregatore'!$F$2","v":"Valore CE 2018"},"TIPOLOGIA DI CONTRATTO",null,"% di incidenza\nmultiservizio"]
[null,null,null,"Importo Multiservizio","Importo Altro"]
["BA1580","Lavanderia",{"$f":"SUMIF('00 CE'!$B:$B,$A5,'00 CE'!$G:$G)","v":4633285.6399999997},0,{"$f":"C5-D5","v":4633285.6399999997},{"$f":"IF(D5=0,0,IF(C5=0,\"\",D5/C5))","v":0}]
["BA1590","Pulizia",{"$f":"SUMIF('00 CE'!$B:$B,$A6,'00 CE'!$G:$G)","v":6110953.9000000004},0,6110953.9000000004,0]
["BA1600","Mensa",{"$f":"SUMIF('00 CE'!$B:$B,$A7,'00 CE'!$G:$G)","v":4253494.91},0,4253494.91,0]
["BA1610","Riscaldamento",{"$f":"SUMIF('00 CE'!$B:$B,$A8,'00 CE'!$G:$G)","v":912590.81},0,912590.81,0]
["BA1620","Servizi di assistenza informatica",{"$f":"SUMIF('00 CE'!$B:$B,$A9,'00 CE'!$G:$G)","v":1812783.81},0,1812783.81,0]
["BA1630","Servizi trasporti (non sanitari)",{"$f":"SUMIF('00 CE'!$B:$B,$A10,'00 CE'!$G:$G)","v":5892.6},0,5892.6,0]
["BA1640","Smaltimento rifiuti",{"$f":"SUMIF('00 CE'!$B:$B,$A11,'00 CE'!$G:$G)","v":1392025.82},0,1392025.82,0]
["BA1650","Utenze telefoniche",{"$f":"SUMIF('00 CE'!$B:$B,$A12,'00 CE'!$G:$G)","v":940270.67},0,940270.67,0]
["BA1660","Utenze elettricità",{"$f":"SUMIF('00 CE'!$B:$B,$A13,'00 CE'!$G:$G)","v":3337366.78},0,3337366.78,0]
["BA1670","Altre utenze",{"$f":"SUMIF('00 CE'!$B:$B,$A14,'00 CE'!$G:$G)","v":875740.52},0,875740.52,0]
["BA1680","Premi di assicurazione",{"$f":"SUMIF('00 CE'!$B:$B,$A15,'00 CE'!$G:$G)","v":4728617.0999999996},0,4728617.0999999996,0]
["BA1720","Altri servizi non sanitari da pubblico (Aziende sanitarie pubbliche della Regione)",{"$f":"SUMIF('00 CE'!$B:$B,$A16,'00 CE'!$G:$G)","v":0},0,0,0]
["BA1730","Altri servizi non sanitari da altri soggetti pubblici",{"$f":"SUMIF('00 CE'!$B:$B,$A17,'00 CE'!$G:$G)","v":0},0,0,0]
["BA1740","Altri servizi non sanitari da privato",{"$f":"SUMIF('00 CE'!$B:$B,$A18,'00 CE'!$G:$G)","v":6621405.9100000001},0,6621405.9100000001,0]
["BA1890","Formazione (esternalizzata e non) da pubblico",{"$f":"SUMIF('00 CE'!$B:$B,$A19,'00 CE'!$G:$G)","v":35012.980000000003},0,35012.980000000003,0]
["BA1900","Formazione (esternalizzata e non) da privato",{"$f":"SUMIF('00 CE'!$B:$B,$A20,'00 CE'!$G:$G)","v":626252.09},0,626252.09,0]
["BA1910","Manutenzione e riparazione (ordinaria esternalizzata):",{"$f":"SUMIF('00 CE'!$B:$B,$A21,'00 CE'!$G:$G)","v":15710849.98},0,15710849.98,0]
["BA1920","Manutenzione e riparazione ai fabbricati e loro pertinenze",{"$f":"SUMIF('00 CE'!$B:$B,$A22,'00 CE'!$G:$G)","v":8571730.1999999993},0,8571730.1999999993,0]
["BA1930","Manutenzione e riparazione agli impianti e macchinari",{"$f":"SUMIF('00 CE'!$B:$B,$A23,'00 CE'!$G:$G)","v":0},0,0,0]
["BA1940","Manutenzione e riparazione alle attrezzature sanitarie e scientifiche",{"$f":"SUMIF('00 CE'!$B:$B,$A24,'00 CE'!$G:$G)","v":6129147.0499999998},0,6129147.0499999998,0]
["BA1950","Manutenzione e riparazione ai mobili e arredi",{"$f":"SUMIF('00 CE'!$B:$B,$A25,'00 CE'!$G:$G)","v":0},0,0,0]
["BA1960","Manutenzione e riparazione agli automezzi",{"$f":"SUMIF('00 CE'!$B:$B,$A26,'00 CE'!$G:$G)","v":125986.4},0,125986.4,0]
["BA1970","Altre manutenzioni e riparazioni",{"$f":"SUMIF('00 CE'!$B:$B,$A27,'00 CE'!$G:$G)","v":883986.33},0,883986.33,0]
["BA1980","Manutenzioni e riparazioni da Aziende sanitarie pubbliche della Regione",{"$f":"SUMIF('00 CE'!$B:$B,$A28,'00 CE'!$G:$G)","v":0},0,0,0]
[null,"TOTALE",{"$f":"SUM(C5:C21)","v":51996543.519999996},0,51996543.519999996,0]
[]
[]
[null,"Tab. 65 – Dettaglio canoni di leasing "]
[null,"DETTAGLIO LEASING","Valore contratto con IVA","Costo imputato all'esercizio","Canoni a scadere","Delibera",null,null,"Decorrenza contratto","Scadenza contratto"]
[]
[null,"Leasing attivati con fondi aziendali:"]
[null,"Cellule Staminali"]
[null,"Leasing finanziari finanziati dalla Regione:"]
[null,"…"]
[null,"…"]
[null,"…"]

{"sheet":"Tab 66-67-68-69","index":26,"n_rows":175,"n_cols":11,"rows_kept":175,"cut":false,"hidden":false,"merged":[[0,0,0,5],[3,1,3,5],[4,0,5,0],[4,1,5,1],[4,2,5,2],[4,3,5,3],[4,4,5,4],[4,5,5,5],[97,5,98,5],[58,1,58,5],[59,0,60,0],[59,1,60,1],[59,2,60,2],[59,3,60,3],[59,4,60,4],[59,5,60,5],[97,0,98,0],[97,1,98,1],[97,2,98,2],[97,3,98,3],[97,4,98,4],[174,1,174,5],[134,1,134,5],[135,0,136,0],[135,1,136,1],[135,2,136,2],[135,3,136,3],[135,4,136,4],[135,5,136,5]]}
["21.     Costi del personale"]
[]
[]
[null,"Tab. 66 – Costi del personale – ruolo sanitario"]
["CODICE MOD. CE","COSTI DEL PERSONALE","Valore CE 2018","Valore CE 2017","Variazioni\nimporto","%"]
[null,null,null,null,null,null,null,"Diff 2015","Ctrl","Diff 2014","Ctrl"]
["BA2090","PERSONALE DEL RUOLO SANITARIO",{"$f":"C8+C41","v":139820551.13999999},{"$f":"D8+D41","v":138175218.69},{"$f":"C7-D7","v":1645332.4499999881},{"$f":"IF(AND(C7=0,D7=0),0,IF(C7=0,\"\",IF(D7=0,\"\",E7/D7)))","v":1.1907579851140587E-2}]
["BA2100","Costo del personale dirigente ruolo sanitario",{"$f":"C9+C25","v":72571422.890000001},{"$f":"D9+D25","v":73318273.719999999},{"$f":"C8-D8","v":-746850.82999999821},{"$f":"IF(AND(C8=0,D8=0),0,IF(C8=0,\"\",IF(D8=0,\"\",E8/D8)))","v":-1.0186421366823177E-2}]
["BA2110","Costo del personale dirigente medico",{"$f":"C10+C17+C24","v":67351870.719999999},{"$f":"D10+D17+D24","v":68148859.189999998},{"$f":"C9-D9","v":-796988.46999999881},-1.1694817484442161E-2]
["BA2120","Costo del personale dirigente medico - tempo indeterminato",{"$f":"SUMIF('00 CE'!$B:$B,'Tab 66-67-68-69'!$A10,'00 CE'!G:G)","v":64319241.780000001},{"$f":"SUMIF('00 CE'!$B:$B,'Tab 66-67-68-69'!$A10,'00 CE'!F:F)","v":66243178.869999997},{"$f":"C10-D10","v":-1923937.0899999961},-2.9043550186135508E-2,null,{"$f":"C10-(C11+C12+C13+C14+C15+C16)","v":-7.2386115789413452E-4},{"$f":"IF(H10=0,\"OK\",\" CTRL\")","v":" CTRL"},{"$f":"D10-(D11+D12+D13+D14+D15+D16)","v":0},{"$f":"IF(J10=0,\"OK\",\" CTRL\")","v":"OK"}]
[null,"Voci di costo a carattere stipendiale",33125068.316363633,34123950.691818185,{"$f":"C11-D11","v":-998882.37545455247},-2.9272178490577061E-2]
[null,"Retribuzione di posizione",2833858.3200000003,2959281.0400000005,-125422.7200000002,-4.238283498751446E-2]
[null,"Indennità di risultato",3790145.9143602364,3696611.3181818188,93534.59617841756,2.5302794404801699E-2]
[null,"Altro trattamento accessorio",9879725.7699999996,10064006.789999997,-184281.01999999769,-1.8310899808126793E-2]
[null,"Oneri sociali su retribuzione",14651043.32,15117441.619999999,-466398.29999999888,-3.0851668670111847E-2]
[null,"Altri oneri per il personale",39400.14,281887.41000000003,-242487.27000000002,-0.86022738652996245]
["BA2130","Costo del personale dirigente medico - tempo determinato",{"$f":"SUMIF('00 CE'!$B:$B,'Tab 66-67-68-69'!$A17,'00 CE'!G:G)","v":3032628.94},{"$f":"SUMIF('00 CE'!$B:$B,'Tab 66-67-68-69'!$A17,'00 CE'!F:F)","v":1905680.32},{"$f":"C17-D17","v":1126948.6199999999},0.59136288923842162,null,{"$f":"C17-(C18+C19+C20+C21+C22+C23)","v":0},{"$f":"IF(H17=0,\"OK\",\" CTRL\")","v":"OK"},{"$f":"D17-(D18+D19+D20+D21+D22+D23)","v":0},{"$f":"IF(J17=0,\"OK\",\" CTRL\")","v":"OK"}]
[null,"Voci di costo a carattere stipendiale",2036952.21,1282681.22,{"$f":"C18-D18","v":754270.99},0.58804243660790478]
[null,"Retribuzione di posizione",1207.6400000000001,2328.5700000000002,-1120.93,-0.48138127692102878]
[null,"Indennità di risultato",10066.92,10124.530000000001,-57.610000000000582,-5.6901406781352396E-3]
[null,"Altro trattamento accessorio",227995.23,197516.16,30479.070000000007,0.15431177884381717]
[null,"Oneri sociali su retribuzione",755100.41,413029.84,342070.57,0.82819819991698418]
[null,"Altri oneri per il personale",1306.53,0,1306.53,""]
["BA2140","Costo del personale dirigente medico - altro",{"$f":"SUMIF('00 CE'!$B:$B,'Tab 66-67-68-69'!$A24,'00 CE'!G:G)","v":0},{"$f":"SUMIF('00 CE'!$B:$B,'Tab 66-67-68-69'!$A24,'00 CE'!F:F)","v":0},0,0]
["BA2150","Costo del personale dirigente non medico",{"$f":"C26+C33+C40","v":5219552.17},{"$f":"D26+D33+D40","v":5169414.5299999993},50137.640000000596,9.6989010475042325E-3]
["BA2160","Costo del personale dirigente non medico - tempo indeterminato",{"$f":"SUMIF('00 CE'!$B:$B,'Tab 66-67-68-69'!$A26,'00 CE'!G:G)","v":4831272.49},{"$f":"SUMIF('00 CE'!$B:$B,'Tab 66-67-68-69'!$A26,'00 CE'!F:F)","v":5064518.01},-233245.51999999955,-4.6054830793266263E-2,null,{"$f":"C26-(C27+C28+C29+C30+C31+C32)","v":-1.349886879324913E-4},{"$f":"IF(H26=0,\"OK\",\" CTRL\")","v":" CTRL"},{"$f":"D26-(D27+D28+D29+D30+D31+D32)","v":4.8650102689862251E-3},{"$f":"IF(J26=0,\"OK\",\" CTRL\")","v":" CTRL"}]
[null,"Voci di costo a carattere stipendiale",2574884.4049999993,2744408.62,-169524.21500000078,-6.1770763203622632E-2]
[null,"Retribuzione di posizione",319956.47000000003,360768.17000000004,-40811.700000000012,-0.11312444775823767]
[null,"Indennità di risultato",226151.55513499008,168195.77513498999,57955.780000000086,0.34457333992774869]
[null,"Altro trattamento accessorio",695893.65999999992,727523.52999999968,-31629.869999999763,-4.3476078361341493E-2]
[null,"Oneri sociali su retribuzione",1007940.26,1059409.8600000001,-51469.600000000093,-4.8583274465654011E-2]
[null,"Altri oneri per il personale",6446.1399999999994,4212.05,2234.0899999999992,0.53040443489512212]
["BA2170","Costo del personale dirigente non medico - tempo determinato",{"$f":"SUMIF('00 CE'!$B:$B,'Tab 66-67-68-69'!$A33,'00 CE'!G:G)","v":388279.68},{"$f":"SUMIF('00 CE'!$B:$B,'Tab 66-67-68-69'!$A33,'00 CE'!F:F)","v":104896.52000000002},283383.15999999997,2.7015496796271212,null,{"$f":"C33-(C34+C35+C36+C37+C38+C39)","v":0},{"$f":"IF(H33=0,\"OK\",\" CTRL\")","v":"OK"},{"$f":"D33-(D34+D35+D36+D37+D38+D39)","v":0},{"$f":"IF(J33=0,\"OK\",\" CTRL\")","v":"OK"}]
[null,"Voci di costo a carattere stipendiale",292658.29999999993,76363.53,216294.76999999993,2.832435457082719]
[null,"Retribuzione di posizione",2786.41,1232.56,1553.85,1.2606688518206011]
[null,"Indennità di risultato",0,0,0,0]
[null,"Altro trattamento accessorio",11558.449999999999,2950.9999999999995,8607.4499999999989,2.9167909183327687]
[null,"Oneri sociali su retribuzione",81276.52,22573.11,58703.41,2.6005902598268471]
[null,"Altri oneri per il personale",0,1776.32,-1776.32,""]
["BA2180","Costo del personale dirigente non medico - altro",{"$f":"SUMIF('00 CE'!$B:$B,'Tab 66-67-68-69'!$A40,'00 CE'!G:G)","v":0},{"$f":"SUMIF('00 CE'!$B:$B,'Tab 66-67-68-69'!$A40,'00 CE'!F:F)","v":0},{"$f":"C40-D40","v":0},0]
["BA2190","Costo del personale comparto ruolo sanitario",{"$f":"C42+C49+C56","v":67249128.25},{"$f":"D42+D49+D56","v":64856944.969999991},{"$f":"C41-D41","v":2392183.2800000086},3.6883995709426784E-2]
["BA2200","Costo del personale comparto ruolo sanitario - tempo indeterminato",{"$f":"SUMIF('00 CE'!$B:$B,'Tab 66-67-68-69'!$A42,'00 CE'!G:G)","v":65514162.510000005},{"$f":"SUMIF('00 CE'!$B:$B,'Tab 66-67-68-69'!$A42,'00 CE'!F:F)","v":64044509.309999995},{"$f":"C42-D42","v":1469653.2000000104},2.2947372317060392E-2,null,{"$f":"C42-(C43+C44+C45+C46+C47+C48)","v":5.9551000595092773E-4},{"$f":"IF(H42=0,\"OK\",\" CTRL\")","v":" CTRL"},{"$f":"D42-(D43+D44+D45+D46+D47+D48)","v":0},{"$f":"IF(J42=0,\"OK\",\" CTRL\")","v":"OK"}]
[null,"Voci di costo a carattere stipendiale",45261782.468636364,43553276.678181812,{"$f":"C43-D43","v":1708505.7904545516},3.9227950702281703E-2]
[null,"Straordinario e indennità personale",0,1044273.96,-1044273.96,""]
[null,"Retribuzione per produttività personale",2282319.6607681308,1991913.4518181859,290406.20894994494,0.14579258385190727]
[null,"Altro trattamento accessorio",3646231.3900000006,3768572.82,-122341.42999999924,-3.2463597187435862E-2]
[null,"Oneri sociali su retribuzione",13961363.859999999,13345209.789999999,616154.0700000003,4.6170429666958453E-2]
[null,"Altri oneri per il personale",362465.13,341262.60999999993,21202.520000000077,6.2129630902137453E-2]
["BA2210","Costo del personale comparto ruolo sanitario - tempo determinato",{"$f":"SUMIF('00 CE'!$B:$B,'Tab 66-67-68-69'!$A49,'00 CE'!G:G)","v":1734965.7400000002},{"$f":"SUMIF('00 CE'!$B:$B,'Tab 66-67-68-69'!$A49,'00 CE'!F:F)","v":812435.66},{"$f":"C49-D49","v":922530.08000000019},1.1355115554627428,null,{"$f":"C49-(C50+C51+C52+C53+C54+C55)","v":0},{"$f":"IF(H49=0,\"OK\",\" CTRL\")","v":"OK"},{"$f":"D49-(D50+D51+D52+D53+D54+D55)","v":0},{"$f":"IF(J49=0,\"OK\",\" CTRL\")","v":"OK"}]
[null,"Voci di costo a carattere stipendiale",1210322.56,571961.26,{"$f":"C50-D50","v":638361.30000000005},1.1160918485982776]
[null,"Straordinario e indennità personale",0,4630.670000000001,-4630.670000000001,""]
[null,"Retribuzione per produttività personale",10,0,10,""]
[null,"Altro trattamento accessorio",112816.03,58248.3,54567.729999999996,0.93681240482554839]
[null,"Oneri sociali su retribuzione",405094.45999999996,177148.29,227946.16999999995,1.2867534312637166]
[null,"Altri oneri per il personale",6722.69,447.14,6275.5499999999993,14.034866037482667]
["BA2220","Costo del personale comparto ruolo sanitario - altro",{"$f":"SUMIF('00 CE'!$B:$B,'Tab 66-67-68-69'!$A56,'00 CE'!G:G)","v":0},{"$f":"SUMIF('00 CE'!$B:$B,'Tab 66-67-68-69'!$A56,'00 CE'!F:F)","v":0},{"$f":"C56-D56","v":0},0]
[]
[]
[null,"Tab. 67 – Costi del personale – ruolo professionale"]
["CODICE MOD. CE","COSTI DEL PERSONALE","Valore CE 2018","Valore CE 2017","Variazioni\nimporto","%"]
[null,null,null,null,null,null,null,"Diff 2015","Ctrl","Diff 2014","Ctrl"]
["BA2230","PERSONALE DEL RUOLO PROFESSIONALE",{"$f":"C63+C79","v":438861.05999999994},{"$f":"D63+D79","v":438201.74},{"$f":"C62-D62","v":659.31999999994878},{"$f":"IF(AND(C62=0,D62=0),0,IF(C62=0,\"\",IF(D62=0,\"\",E62/D62)))","v":1.5046037927643756E-3}]
["BA2240","Costo del personale dirigente ruolo professionale",{"$f":"C64+C71+C78","v":437281.32999999996},{"$f":"D64+D71+D78","v":425798.17},{"$f":"C63-D63","v":11483.159999999974},{"$f":"IF(AND(C63=0,D63=0),0,IF(C63=0,\"\",IF(D63=0,\"\",E63/D63)))","v":2.696855179062882E-2}]
["BA2250","Costo del personale dirigente ruolo professionale - tempo indeterminato",{"$f":"SUMIF('00 CE'!$B:$B,'Tab 66-67-68-69'!$A64,'00 CE'!G:G)","v":367654.11},{"$f":"SUMIF('00 CE'!$B:$B,'Tab 66-67-68-69'!$A64,'00 CE'!F:F)","v":404674.32},{"$f":"C64-D64","v":-37020.210000000021},-9.1481490597179527E-2,null,{"$f":"C64-(C65+C66+C67+C68+C69+C70)","v":3.7946821539662778E-3},{"$f":"IF(H64=0,\"OK\",\" CTRL\")","v":" CTRL"},{"$f":"D64-(D65+D66+D67+D68+D69+D70)","v":-2.7715465403161943E-3},{"$f":"IF(J64=0,\"OK\",\" CTRL\")","v":" CTRL"}]
[null,"Voci di costo a carattere stipendiale",130908.1,159996.66,{"$f":"C65-D65","v":-29088.559999999998},-0.18180729522728786]
[null,"Retribuzione di posizione",92096.56,98834.01999999999,-6737.4599999999919,-6.8169442060537377E-2]
[null,"Indennità di risultato",51857.936205317834,51671.102771546517,186.83343377131678,3.6158205215275465E-3]
[null,"Altro trattamento accessorio",18544.88,12186.27,6358.6100000000006,0.52178476268784468]
[null,"Oneri sociali su retribuzione",74246.63,81986.27,-7739.6399999999994,-9.4401660180417998E-2]
[null,"Altri oneri per il personale",0,0,0,0]
["BA2260","Costo del personale dirigente ruolo professionale - tempo determinato",{"$f":"SUMIF('00 CE'!$B:$B,'Tab 66-67-68-69'!$A71,'00 CE'!G:G)","v":69627.22},{"$f":"SUMIF('00 CE'!$B:$B,'Tab 66-67-68-69'!$A71,'00 CE'!F:F)","v":21123.85},{"$f":"C71-D71","v":48503.37},2.2961425119000562,null,{"$f":"C71-(C72+C73+C74+C75+C76+C77)","v":0},{"$f":"IF(H71=0,\"OK\",\" CTRL\")","v":"OK"},{"$f":"D71-(D72+D73+D74+D75+D76+D77)","v":0},{"$f":"IF(J71=0,\"OK\",\" CTRL\")","v":"OK"}]
[null,"Voci di costo a carattere stipendiale",43635.979999999996,15694.859999999999,{"$f":"C72-D72","v":27941.119999999995},1.7802720126206921]
[null,"Retribuzione di posizione",7689.57,208.70999999999998,7480.86,35.843323271525087]
[null,"Indennità di risultato",0,0,0,0]
[null,"Altro trattamento accessorio",3170.77,578.41999999999996,2592.35,4.4817779468206496]
[null,"Oneri sociali su retribuzione",15130.9,4641.8599999999997,10489.04,2.2596631522708575]
[null,"Altri oneri per il personale",0,0,0,0]
["BA2270","Costo del personale dirigente ruolo professionale - altro",{"$f":"SUMIF('00 CE'!$B:$B,'Tab 66-67-68-69'!$A78,'00 CE'!G:G)","v":0},{"$f":"SUMIF('00 CE'!$B:$B,'Tab 66-67-68-69'!$A78,'00 CE'!F:F)","v":0},{"$f":"C78-D78","v":0},0]
["BA2280","Costo del personale comparto ruolo professionale",{"$f":"C80+C87+C94","v":1579.73},{"$f":"D80+D87+D94","v":12403.57},{"$f":"C79-D79","v":-10823.84},-0.872639086972541]
["BA2290","Costo del personale comparto ruolo professionale - tempo indeterminato",{"$f":"SUMIF('00 CE'!$B:$B,'Tab 66-67-68-69'!$A80,'00 CE'!G:G)","v":1579.73},{"$f":"SUMIF('00 CE'!$B:$B,'Tab 66-67-68-69'!$A80,'00 CE'!F:F)","v":12403.57},{"$f":"C80-D80","v":-10823.84},-0.872639086972541,null,{"$f":"C80-(C81+C82+C83+C84+C85+C86)","v":0},{"$f":"IF(H80=0,\"OK\",\" CTRL\")","v":"OK"},{"$f":"D80-(D81+D82+D83+D84+D85+D86)","v":4.6947443570388714E-3},{"$f":"IF(J80=0,\"OK\",\" CTRL\")","v":" CTRL"}]
[null,"Voci di costo a carattere stipendiale",1276,8038.4100000000017,{"$f":"C81-D81","v":-6762.4100000000017},-0.84126214014960676]
[null,"Straordinario e indennità personale",0,0,0,0]
[null,"Indennità di risultato",0,1016.6953052556421,-1016.6953052556421,""]
[null,"Altro trattamento accessorio",0,776.98,-776.98,""]
[null,"Oneri sociali su retribuzione",303.73,2571.48,-2267.75,-0.88188514007497631]
[null,"Altri oneri per il personale",0,0,0,0]
["BA2300","Costo del personale comparto ruolo professionale - tempo determinato",{"$f":"SUMIF('00 CE'!$B:$B,'Tab 66-67-68-69'!$A87,'00 CE'!G:G)","v":0},{"$f":"SUMIF('00 CE'!$B:$B,'Tab 66-67-68-69'!$A87,'00 CE'!F:F)","v":0},{"$f":"C87-D87","v":0},0,null,{"$f":"C87-(C88+C89+C90+C91+C92+C93)","v":0},{"$f":"IF(H87=0,\"OK\",\" CTRL\")","v":"OK"},{"$f":"D87-(D88+D89+D90+D91+D92+D93)","v":0},{"$f":"IF(J87=0,\"OK\",\" CTRL\")","v":"OK"}]
[null,"Voci di costo a carattere stipendiale",0,0,{"$f":"C88-D88","v":0},0]
[null,"Straordinario e indennità personale",0,0,0,0]
[null,"Indennità di risultato",0,0,0,0]
[null,"Altro trattamento accessorio",0,0,0,0]
[null,"Oneri sociali su retribuzione",0,0,0,0]
[null,"Altri oneri per il personale",0,0,0,0]
["BA2310","Costo del personale comparto ruolo professionale - altro",{"$f":"SUMIF('00 CE'!$B:$B,'Tab 66-67-68-69'!$A94,'00 CE'!G:G)","v":0},{"$f":"SUMIF('00 CE'!$B:$B,'Tab 66-67-68-69'!$A94,'00 CE'!F:F)","v":0},{"$f":"C94-D94","v":0},0]
[]
[]
[null,"Tab. 68 – Costi del personale – ruolo tecnico"]
["CODICE MOD. CE","COSTI DEL PERSONALE","Valore CE 2018","Valore CE 2017","Variazioni\nimporto","%"]
[null,null,null,null,null,null,null,"Diff 2015","Ctrl","Diff 2014","Ctrl"]
["BA2320","PERSONALE DEL RUOLO TECNICO",{"$f":"C101+C117","v":17518842.809999999},{"$f":"D101+D117","v":16516470.15},{"$f":"C100-D100","v":1002372.6599999983},{"$f":"IF(AND(C100=0,D100=0),0,IF(C100=0,\"\",IF(D100=0,\"\",E100/D100)))","v":6.0689278695544899E-2}]
["BA2330","Costo del personale dirigente ruolo tecnico",{"$f":"C102+C109+C116","v":345702.9},{"$f":"D102+D109+D116","v":375739.52999999997},{"$f":"C101-D101","v":-30036.629999999946},{"$f":"IF(AND(C101=0,D101=0),0,IF(C101=0,\"\",IF(D101=0,\"\",E101/D101)))","v":-7.9940031861965521E-2}]
["BA2340","Costo del personale dirigente ruolo tecnico - tempo indeterminato",{"$f":"SUMIF('00 CE'!$B:$B,'Tab 66-67-68-69'!$A102,'00 CE'!G:G)","v":345702.9},{"$f":"SUMIF('00 CE'!$B:$B,'Tab 66-67-68-69'!$A102,'00 CE'!F:F)","v":375739.52999999997},{"$f":"C102-D102","v":-30036.629999999946},-7.9940031861965521E-2,null,{"$f":"C102-(C103+C104+C105+C106+C107+C108)","v":-2.5664723943918943E-4},{"$f":"IF(H102=0,\"OK\",\" CTRL\")","v":" CTRL"},{"$f":"D102-(D103+D104+D105+D106+D107+D108)","v":1.5355668729171157E-3},{"$f":"IF(J102=0,\"OK\",\" CTRL\")","v":" CTRL"}]
[null,"Voci di costo a carattere stipendiale",131325.37999999998,153284.84,{"$f":"C103-D103","v":-21959.460000000021},-0.14325917683705722]
[null,"Retribuzione di posizione",79767.320000000007,81703.89,-1936.5699999999924,-2.3702298629844826E-2]
[null,"Indennità di risultato",64822.420256647289,64588.878464433146,233.54179221414233,3.6158205215274901E-3]
[null,"Altro trattamento accessorio",0,0,0,0]
[null,"Oneri sociali su retribuzione",69787.78,76161.919999999998,-6374.1399999999994,-8.3691955244825755E-2]
[null,"Altri oneri per il personale",0,0,0,0]
["BA2350","Costo del personale dirigente ruolo tecnico - tempo determinato",{"$f":"SUMIF('00 CE'!$B:$B,'Tab 66-67-68-69'!$A109,'00 CE'!G:G)","v":0},{"$f":"SUMIF('00 CE'!$B:$B,'Tab 66-67-68-69'!$A109,'00 CE'!F:F)","v":0},{"$f":"C109-D109","v":0},0,null,{"$f":"C109-(C110+C111+C112+C113+C114+C115)","v":0},{"$f":"IF(H109=0,\"OK\",\" CTRL\")","v":"OK"},{"$f":"D109-(D110+D111+D112+D113+D114+D115)","v":0},{"$f":"IF(J109=0,\"OK\",\" CTRL\")","v":"OK"}]
[null,"Voci di costo a carattere stipendiale",0,0,{"$f":"C110-D110","v":0},0]
[null,"Retribuzione di posizione",0,0,0,0]
[null,"Indennità di risultato",0,0,0,0]
[null,"Altro trattamento accessorio",0,0,0,0]
[null,"Oneri sociali su retribuzione",0,0,0,0]
[null,"Altri oneri per il personale",0,0,0,0]
["BA2360","Costo del personale dirigente ruolo tecnico - altro",{"$f":"SUMIF('00 CE'!$B:$B,'Tab 66-67-68-69'!$A116,'00 CE'!G:G)","v":0},{"$f":"SUMIF('00 CE'!$B:$B,'Tab 66-67-68-69'!$A116,'00 CE'!F:F)","v":0},{"$f":"C116-D116","v":0},0]
["BA2370","Costo del personale comparto ruolo tecnico",{"$f":"C118+C125+C132","v":17173139.91},{"$f":"D118+D125+D132","v":16140730.620000001},{"$f":"C117-D117","v":1032409.2899999991},6.3962983727684511E-2]
["BA2380","Costo del personale comparto ruolo tecnico - tempo indeterminato",{"$f":"SUMIF('00 CE'!$B:$B,'Tab 66-67-68-69'!$A118,'00 CE'!G:G)","v":16881837.510000002},{"$f":"SUMIF('00 CE'!$B:$B,'Tab 66-67-68-69'!$A118,'00 CE'!F:F)","v":15963506.970000001},{"$f":"C118-D118","v":918330.54000000097},5.7526866854871357E-2,null,{"$f":"C118-(C119+C120+C121+C122+C123+C124)","v":0},{"$f":"IF(H118=0,\"OK\",\" CTRL\")","v":"OK"},{"$f":"D118-(D119+D120+D121+D122+D123+D124)","v":0},{"$f":"IF(J118=0,\"OK\",\" CTRL\")","v":"OK"}]
[null,"Voci di costo a carattere stipendiale",11798314.085909091,10965254.684545454,{"$f":"C119-D119","v":833059.4013636373},7.5972644989063504E-2]
[null,"Straordinario",0,276416.17,-276416.17,""]
[null,"Indennità di risultato",675914.77293944161,550517.45545454731,125397.3174848943,0.2277808201038006]
[null,"Altro trattamento accessorio",754755.58000000007,708502.31,46253.270000000019,6.5283160474099253E-2]
[null,"Oneri sociali su retribuzione",3531050.0611514691,3326919.6,204130.46115146903,6.1357196955246239E-2]
[null,"Altri oneri per il personale",121803.01,135896.75,-14093.740000000005,-0.10370917626801233]
["BA2390","Costo del personale comparto ruolo tecnico - tempo determinato",{"$f":"SUMIF('00 CE'!$B:$B,'Tab 66-67-68-69'!$A125,'00 CE'!G:G)","v":291302.39999999997},{"$f":"SUMIF('00 CE'!$B:$B,'Tab 66-67-68-69'!$A125,'00 CE'!F:F)","v":177223.65000000002},{"$f":"C125-D125","v":114078.74999999994},0.64369935953807478,null,{"$f":"C125-(C126+C127+C128+C129+C130+C131)","v":0},{"$f":"IF(H125=0,\"OK\",\" CTRL\")","v":"OK"},{"$f":"D125-(D126+D127+D128+D129+D130+D131)","v":0},{"$f":"IF(J125=0,\"OK\",\" CTRL\")","v":"OK"}]
[null,"Voci di costo a carattere stipendiale",179552.4,133711.14000000001,{"$f":"C126-D126","v":45841.25999999998},0.34283800138118614]
[null,"Straordinario",0,3035.49,-3035.49,""]
[null,"Indennità di risultato",0,0,0,0]
[null,"Altro trattamento accessorio",0,1502.16,-1502.16,""]
[null,"Oneri sociali su retribuzione",111749.99999999997,38974.86,72775.13999999997,1.8672328778089253]
[null,"Altri oneri per il personale",0,0,0,0]
["BA2400","Costo del personale comparto ruolo tecnico - altro",{"$f":"SUMIF('00 CE'!$B:$B,'Tab 66-67-68-69'!$A132,'00 CE'!G:G)","v":0},{"$f":"SUMIF('00 CE'!$B:$B,'Tab 66-67-68-69'!$A132,'00 CE'!F:F)","v":0},{"$f":"C132-D132","v":0},0]
[]
[]
[null,"Tab. 69 – Costi del personale – ruolo amministrativo"]
["CODICE MOD. CE","COSTI DEL PERSONALE","Valore CE 2018","Valore CE 2017","Variazioni\nimporto","%"]
[null,null,null,null,null,null,null,"Diff 2015","Ctrl","Diff 2014","Ctrl"]
["BA2410","PERSONALE DEL RUOLO AMMINISTRATIVO",{"$f":"C139+C155","v":10097306.58},{"$f":"D139+D155","v":10114311.859999999},{"$f":"C138-D138","v":-17005.279999999329},{"$f":"IF(AND(C138=0,D138=0),0,IF(C138=0,\"\",IF(D138=0,\"\",E138/D138)))","v":-1.6813086481198662E-3}]
["BA2420","Costo del personale dirigente ruolo amministrativo",{"$f":"C140+C147+C154","v":938060.23},{"$f":"D140+D147+D154","v":824224.55},{"$f":"C139-D139","v":113835.67999999993},{"$f":"IF(AND(C139=0,D139=0),0,IF(C139=0,\"\",IF(D139=0,\"\",E139/D139)))","v":0.13811245976597025}]
["BA2430","Costo del personale dirigente ruolo amministrativo - tempo indeterminato",{"$f":"SUMIF('00 CE'!$B:$B,'Tab 66-67-68-69'!$A140,'00 CE'!G:G)","v":922464.95},{"$f":"SUMIF('00 CE'!$B:$B,'Tab 66-67-68-69'!$A140,'00 CE'!F:F)","v":824224.55},{"$f":"C140-D140","v":98240.399999999907},0.11919130533056786,null,{"$f":"C140-(C141+C142+C143+C144+C145+C146)","v":0},{"$f":"IF(H140=0,\"OK\",\" CTRL\")","v":"OK"},{"$f":"D140-(D141+D142+D143+D144+D145+D146)","v":-4.1573198977857828E-3},{"$f":"IF(J140=0,\"OK\",\" CTRL\")","v":" CTRL"}]
[null,"Voci di costo a carattere stipendiale",330402.85999999993,244742.47000000006,{"$f":"C141-D141","v":85660.389999999868},0.35000214715492511]
[null,"Retribuzione di posizione",227556.87000000002,226009.87000000002,1547,6.8448338119038773E-3]
[null,"Indennità di risultato",77786.904307976758,77506.65415731979,280.25015065696789,3.6158205215274519E-3]
[null,"Altro trattamento accessorio",83931.01,97520.77,-13589.760000000009,-0.13935246819728769]
[null,"Oneri sociali su retribuzione",202787.30569202331,178444.79,24342.515692023298,0.13641482999880969]
[null,"Altri oneri per il personale",0,0,0,0]
["BA2440","Costo del personale dirigente ruolo amministrativo - tempo determinato",{"$f":"SUMIF('00 CE'!$B:$B,'Tab 66-67-68-69'!$A147,'00 CE'!G:G)","v":15595.28},{"$f":"SUMIF('00 CE'!$B:$B,'Tab 66-67-68-69'!$A147,'00 CE'!F:F)","v":0},{"$f":"C147-D147","v":15595.28},"",null,{"$f":"C147-(C148+C149+C150+C151+C152+C153)","v":0},{"$f":"IF(H147=0,\"OK\",\" CTRL\")","v":"OK"},{"$f":"D147-(D148+D149+D150+D151+D152+D153)","v":0},{"$f":"IF(J147=0,\"OK\",\" CTRL\")","v":"OK"}]
[null,"Voci di costo a carattere stipendiale",11944.62,0,{"$f":"C148-D148","v":11944.62},""]
[null,"Retribuzione di posizione",220,0,220,""]
[null,"Indennità di risultato",0,0,0,0]
[null,"Altro trattamento accessorio",0,0,0,0]
[null,"Oneri sociali su retribuzione",3430.66,0,3430.66,""]
[null,"Altri oneri per il personale",0,0,0,0]
["BA2450","Costo del personale dirigente ruolo amministrativo - altro",{"$f":"SUMIF('00 CE'!$B:$B,'Tab 66-67-68-69'!$A154,'00 CE'!G:G)","v":0},{"$f":"SUMIF('00 CE'!$B:$B,'Tab 66-67-68-69'!$A154,'00 CE'!F:F)","v":0},{"$f":"C154-D154","v":0},0]
["BA2460","Costo del personale comparto ruolo amministrativo",{"$f":"C156+C163+C170","v":9159246.3499999996},{"$f":"D156+D163+D170","v":9290087.3099999987},{"$f":"C155-D155","v":-130840.95999999903},-1.4083932220869413E-2]
["BA2470","Costo del personale comparto ruolo amministrativo - tempo indeterminato",{"$f":"SUMIF('00 CE'!$B:$B,'Tab 66-67-68-69'!$A156,'00 CE'!G:G)","v":9121759.0600000005},{"$f":"SUMIF('00 CE'!$B:$B,'Tab 66-67-68-69'!$A156,'00 CE'!F:F)","v":9288718.9999999981},{"$f":"C156-D156","v":-166959.93999999762},-1.7974484963965177E-2,null,{"$f":"C156-(C157+C158+C159+C160+C161+C162)","v":0},{"$f":"IF(H156=0,\"OK\",\" CTRL\")","v":"OK"},{"$f":"D156-(D157+D158+D159+D160+D161+D162)","v":4.3078754097223282E-3},{"$f":"IF(J156=0,\"OK\",\" CTRL\")","v":" CTRL"}]
[null,"Voci di costo a carattere stipendiale",6472652.2790909084,6616939.125454546,{"$f":"C157-D157","v":-144286.8463636376},-2.1805678370016124E-2]
[null,"Straordinario",0,86745.58,-86745.58,""]
[null,"Indennità di risultato",430177.25748515414,349555.88023757591,80621.377247578232,0.23063945367700253]
[null,"Altro trattamento accessorio",204106.56999999998,230889.74,-26783.170000000013,-0.11599982745010677]
[null,"Oneri sociali su retribuzione",1949356.3934239373,1952572.67,-3216.2765760626644,-1.6471994233447221E-3]
[null,"Altri oneri per il personale",65466.560000000012,52016,13450.560000000012,0.25858505075361449]
["BA2480","Costo del personale comparto ruolo amministrativo - tempo determinato",{"$f":"SUMIF('00 CE'!$B:$B,'Tab 66-67-68-69'!$A163,'00 CE'!G:G)","v":37487.29},{"$f":"SUMIF('00 CE'!$B:$B,'Tab 66-67-68-69'!$A163,'00 CE'!F:F)","v":1368.31},{"$f":"C163-D163","v":36118.980000000003},26.396781431108451,null,{"$f":"C163-(C164+C165+C166+C167+C168+C169)","v":0},{"$f":"IF(H163=0,\"OK\",\" CTRL\")","v":"OK"},{"$f":"D163-(D164+D165+D166+D167+D168+D169)","v":0},{"$f":"IF(J163=0,\"OK\",\" CTRL\")","v":"OK"}]
[null,"Voci di costo a carattere stipendiale",32025.060000000012,0,{"$f":"C164-D164","v":32025.060000000012},""]
[null,"Straordinario",0,0,0,0]
[null,"Indennità di risultato",0,0,0,0]
[null,"Altro trattamento accessorio",6000.0199999999995,0,6000.0199999999995,""]
[null,"Oneri sociali su retribuzione",-795.67000000000735,0,-795.67000000000735,""]
[null,"Altri oneri per il personale",257.88,1368.31,-1110.4299999999998,-0.81153393602326951]
["BA2490","Costo del personale comparto ruolo amministrativo - altro",{"$f":"SUMIF('00 CE'!$B:$B,'Tab 66-67-68-69'!$A170,'00 CE'!G:G)","v":0},{"$f":"SUMIF('00 CE'!$B:$B,'Tab 66-67-68-69'!$A170,'00 CE'!F:F)","v":0},{"$f":"C170-D170","v":0},0]
[]
[]
[]
["CP01 - Costi del personale"]
["CP01 - SI","Il costo del personale per l'anno 2018 si attesta ad €/000 167.876."]

{"sheet":"Personale in Comando","index":27,"n_rows":39,"n_cols":5,"rows_kept":39,"cut":false,"hidden":false,"merged":[[0,0,0,4],[2,0,2,3]]}
["Dati sull'occupazione al 31.12.2018"]
[]
["PERSONALE DIPENDENTE (*) (Conto Annuale)"]
[null,"T1A","T1C","T1A","T1C"]
["Tipologia di personale","Personale in comando al 31/12/2017 ad altri enti","Personale in comando al 31/12/2017 da altri enti","Personale in comando al 31/12/2018 ad altri enti","Personale in comando al 31/12/2018 da altri enti"]
["RUOLO SANITARIO"]
["Dirigenza"]
["- Medico veterinaria"]
["- Sanitaria"]
["Comparto"]
["- Categoria Ds"]
["- Categoria D",1,5,4,3]
["- Categoria C"]
["- Categoria Bs"]
["RUOLO PROFESSIONALE"]
["Dirigenza"]
["Livello dirigenziale"]
["Comparto"]
["- Categoria D"]
["RUOLO TECNICO"]
["Dirigenza"]
["Livello dirigenziale"]
["Comparto"]
["- Categoria Ds"]
["- Categoria D"]
["- Categoria C"]
["- Categoria Bs",null,2,null,2]
["- Categoria B"]
["- Categoria A"]
["RUOLO AMMINISTRATIVO"]
["Dirigenza"]
["Livello dirigenziale"]
["Comparto"]
["- Categoria Ds",null,1]
["- Categoria D",1]
["- Categoria C"]
["- Categoria Bs"]
["- Categoria B"]
["- Categoria A"]

{"sheet":"Personale Universitario","index":28,"n_rows":17,"n_cols":5,"rows_kept":17,"cut":false,"hidden":false,"merged":[[0,0,0,4],[2,0,2,3]]}
["Dati sull'occupazione al 31.12.2018"]
[]
["PERSONALE UNIVERSITARIO (Conto Annuale T1B)"]
[]
["Tipologia di personale","Personale al 31/12/2017","di cui a tempo parziale al 31/12/2017","Personale al 31/12/2018","di cui a tempo parziale al 31/12/2018"]
["RUOLO SANITARIO"]
["Dirigenza",12,0,11,0]
["Comparto"]
["RUOLO PROFESSIONALE"]
["Dirigenza"]
["Comparto"]
["RUOLO TECNICO"]
["Dirigenza"]
["Comparto"]
["RUOLO AMMINISTRATIVO"]
["Dirigenza"]
["Comparto"]

{"sheet":"Altro Contratto","index":29,"n_rows":58,"n_cols":3,"rows_kept":58,"cut":false,"hidden":false,"merged":[[50,0,50,2],[0,0,0,2],[2,0,2,2],[18,0,18,2],[34,0,34,2]]}
["Dati sull'occupazione al 31.12.2018"]
[]
["PERSONALE CON ALTRO CONTRATTO - FORMAZIONE LAVORO (Conto Annuale T2)"]
[]
["Tipologia di personale","Uomini/Anno al 31/12/2017","Uomini/Anno al 31/12/2018"]
["RUOLO SANITARIO"]
["Dirigenza"]
["Comparto"]
["RUOLO PROFESSIONALE"]
["Dirigenza"]
["Comparto"]
["RUOLO TECNICO"]
["Dirigenza"]
["Comparto"]
["RUOLO AMMINISTRATIVO"]
["Dirigenza"]
["Comparto"]
[]
["PERSONALE CON ALTRO CONTRATTO - CONTRATTO DI SOMMINISTRAZIONE (Conto Annuale T2)"]
[]
["Tipologia di personale","Uomini/Anno al 31/12/2017","Uomini/Anno al 31/12/2018"]
["RUOLO SANITARIO"]
["Dirigenza"]
["Comparto",42,31]
["RUOLO PROFESSIONALE"]
["Dirigenza"]
["Comparto"]
["RUOLO TECNICO"]
["Dirigenza"]
["Comparto",{"$f":"25+3+20","v":48},40]
["RUOLO AMMINISTRATIVO"]
["Dirigenza"]
["Comparto"]
[]
["PERSONALE CON ALTRO CONTRATTO - CONTRATTO LSU (Conto Annuale T2)"]
[]
["Tipologia di personale","Uomini/Anno al 31/12/2017","Uomini/Anno al 31/12/2018"]
["RUOLO SANITARIO"]
["Dirigenza"]
["Comparto"]
["RUOLO PROFESSIONALE"]
["Dirigenza"]
["Comparto"]
["RUOLO TECNICO"]
["Dirigenza"]
["Comparto"]
["RUOLO AMMINISTRATIVO"]
["Dirigenza"]
["Comparto"]
[]
["PERSONALE IN CONVENZIONE  (FLS 12 quadro E per MMG e PLS)"]
[]
["Tipologia di personale","Uomini/Anno al 31/12/2017","Uomini/Anno al 31/12/2018"]
["MEDICINA DI BASE"]
["MMG",null,269]
["PLS",null,47]
["Continuità assistenziale",null,127]
["Altro",null,10]

{"sheet":"Personale - Conto annuale","index":30,"n_rows":41,"n_cols":9,"rows_kept":41,"cut":false,"hidden":false,"merged":[[0,1,0,8],[2,1,2,4],[3,1,3,5],[40,1,40,8]]}
[null,"Dati sull'occupazione al 31.12.2018"]
[]
[null,"PERSONALE DIPENDENTE (*) (Conto Annuale)"]
[null,"T1",null,null,null,null,"T12","T12","T13"]
[null,"Tipologia di personale","Personale al 31/12/2017","di cui Personale Part Time","Personale al 31/12/2018","di cui Personale Part Time","Numero Mensilità","Totale spese a carattere stipendiale","Totale spese accessorie"]
[null,"RUOLO SANITARIO",2333,40,2274,39,42707,79116293.099999279,30276856.990567736]
[null,"Dirigenza",710,3,668,3,11515,34007035.671361074,22386665.305135064]
["01DIME","- Medico veterinaria",646,3,607,3,10776,31044912.566361066,21165767.820000079]
["01S","- Sanitaria",64,0,61,0,739,2962123.1050000074,1220897.485134986]
[null,"Comparto",1623,37,1606,36,31192,45109257.428638205,7890191.6854326734]
["01COMPDS","- Categoria Ds",40,0,38,0,681,1204642.7400000028,217656.7168533224]
["01COMPD","- Categoria D",1532,37,1527,36,29703,42703786.498638205,7463556.4364481345]
["01COMPC","- Categoria C",51,0,41,0,808,1200828.1900000004,208978.53213121623]
[null,"- Categoria Bs",0,0,null,null,0]
[null,"RUOLO PROFESSIONALE",4,0,3,0,27,188067.74999999988,149935.01200000005]
[null,"Dirigenza",4,0,3,0,27,188067.74999999988,149935.01200000005]
["02PTA","Livello dirigenziale",4,0,3,0,27,188067.74999999988,149935.01200000005]
[null,"Comparto",0,0,0,0,0,0,0]
["02COMPD","- Categoria D",0,0,0,0,0,-8.0000000000000071E-2,0]
[null,"RUOLO TECNICO",531,5,535,7,6945,11891609.245908836,1816352.2059465114]
[null,"Dirigenza",3,0,3,0,20,139951.53000000003,73136.010000000009]
["03PTA","Livello dirigenziale",3,0,3,0,20,139951.53000000003,73136.010000000009]
[null,"Comparto",528,5,532,7,6925,11751657.715908837,1743216.1959465113]
["03COMPDS","- Categoria Ds",5,0,4,0,50,124943.36999999992,13123.797037191809]
["03COMPD","- Categoria D",38,0,31,0,460,1003809.7559090896,73805.324538236513]
["03COMPC","- Categoria C",9,0,10,0,138,251023.10999999964,42464.447592979523]
["03COMPBS","- Categoria Bs",250,2,255,2,3552,5635450.8399998425,966243.68862097862]
["03COMPB","- Categoria B",155,3,161,4,1712,3334382.2499999264,458414.04324697034]
["03COMPA","- Categoria A",71,0,71,1,1013,1402048.3899999782,189164.89491015463]
[null,"RUOLO AMMINISTRATIVO",282,2,264,1,3740,6811580.5790909454,1081917.874620978]
[null,"Dirigenza",8,0,9,0,117,371390.39999999921,402636.33600000001]
["04PTA","Livello dirigenziale",8,0,9,null,117,371390.39999999921,402636.33600000001]
[null,"Comparto",274,2,255,1,3623,6440190.179090946,679281.53862097801]
["04COMPDS","- Categoria Ds",23,0,18,0,301,565704.07999999926,116559.57166736315]
["04COMPD","- Categoria D",65,1,66,0,957,1838801.0390909193,223442.68611366497]
["04COMPC","- Categoria C",63,0,57,0,875,1526941.2300000098,114330.29027998331]
["04COMPBS","- Categoria Bs",0,0,0,0,0,0,0]
["04COMPB","- Categoria B",102,1,97,1,1190,2129522.5000000168,188284.59065190138]
["04COMPA","- Categoria A",21,0,17,0,300,379221.33000000112,36664.399908065192]
[]
[null,"(+) E' necessario comprendere anche il personale dipendente del comparto a tempo determinato che però è rilevato nella Tabella 2 del conto annuale con diverso criterio (uomini - anno)"]

{"sheet":"Tabella 2 Consuntivo","index":31,"n_rows":26,"n_cols":14,"rows_kept":26,"cut":false,"hidden":false,"merged":[[0,3,0,13],[1,3,1,13]]}
[null,null,null,"Tabella 2"]
[null,null,null,"Situazione Consuntivo 2018"]
[]
[null,null,null,"Denominazione regione","Abruzzo"]
[null,null,null,"Denominazione azienda/ente","AUSL PE"]
[null,null,null,"Periodo di rilevazione",2018]
[null,null,null,null,"Totali presenti al 31/12/18","Spesa per comp. fisse                 (2)","Spesa per comp. accessorie     (3)","Totale fisse +  accessorie (4) = (2) + (3)","IRAP (5)","Spese per contributi a carico dell'AUSL    (6)","Altre voci  di spesa         (7)","Totale                  (8)=(4)+(5)+(6)+(7)","di cui per rinnovi contrattuali post anno 2004 (9)","Totale al netto dei rinnovi      (10) = (8) + (9)"]
[null,null,null,null,null,"FI","AC",null,"IR","ON","AL"]
[null,null,null,"Personale dipendente Tempo Indeterm.",2891,98759359.359999955,23149049.450000048,121908408.81,10347067.410000004,33827019.390000023,660819.32999999996,166743314.94,-28192793.765958432,138550521.17404157]
["TI","CEM01","N","- Medici",604,35919093.270000011,13249446.560000051,49168539.830000058,4169367.3299999996,14557001.170000007,37548.71,67932457.040000051,-11974914.173443161,55957542.86655689]
["TI","CEM02","N","- Dirigenti non medici",76,4034429.2900000005,1139254.07,5173683.3600000003,439126.29000000004,1377952.8299999998,11340.02,7002102.5,-1196047.3590381406,5806055.1409618594]
["TI","CEM03","N","- Personale non dirigente",2210,58780486.549999952,8759096.7400000002,67539583.289999947,5736312.6100000041,17885823.800000012,611930.6,91773650.299999952,-15017016.262036234,76756634.037963718]
["TI",null,"S","(categorie protette NON comprese) ",170,3699048.7200000016,307782.38999999996,4006831.1100000017,340380.61999999994,1070049.8099999996,37775.26,5455036.8000000007,-928721.06229508203,4526315.7377049187]
["TI","CEM04","N","- Personale contrattista",1,25350.25,1252.08,26602.33,2261.1799999999998,6241.59,0,35105.100000000006,-4815.9714408973341,30289.128559102672]
[]
["TD",null,null,"Personale a Tempo Determinato",116,3743670.7399999998,611461.15,4355131.8899999997,369059.88000000006,1290834.4600000002,10095.94,6025122.1699999999,-1047219.7535689995,4977902.4164310005]
[]
[null,null,null,"Restante personale",32,2893967,0,2893967,0,0,0,2893967,0,2893967]
[]
[null,null,null,"Totale  ",3039,105396997.09999995,23760510.600000046,129157507.69999999,10716127.290000005,35117853.850000024,670915.2699999999,175662404.11000001,-29240013.519527432,146422390.59047258]
[]
[]
[null,null,null,"Indennità De Maria",11,null,null,null,null,null,null,256736.03,0,256736.03]
[null,null,null,"Medicina Penitenziaria",18,578006.56000000006,103270.65,681277.21000000008,57644.520000000004,187694.84999999998,186.99,926803.57000000007,-176554.99815539457,750248.5718446055]
[]
[null,null,null,null,null,null,null,null,null,null,null,175919140.13999999,"Totale",146679126.62047258]

{"sheet":"Riconciliazione Tabella 2 vs CE","index":32,"n_rows":23,"n_cols":3,"rows_kept":23,"cut":false,"hidden":false,"merged":[]}
["Riconciliazione Tabella 2 e CE consuntivo 2018"]
[]
[]
["Voce CE","Descrizione Voce CE","Importo"]
["BA2080","Totale Costo del personale",167875561.59]
["YA0020","Y.1.A) IRAP relativa a personale dipendente",11109282.459999999]
[null,"TOTALE CE da riconciliare",{"$f":"SUM(C5:C6)","v":178984844.05000001}]
[]
[]
[null,"Spesa del personale indicata nel totale della tabella 2 come da Piano di Rientro",175919140.13999999]
[null,"Costi presenti in Tabella 2 e non presenti nel CE"]
[null,"Restante Personale (COCOCO, Locatio Operis, Barellieri)",-2893967]
[null,"Indennità De Maria",-256736.03]
[null,"Trattenuta a dipendenti - Mensa aziendale",-240333.52]
[null,"Costi presenti nel CE e non presenti in Tabella 2"]
[null,"Categorie Protette",5455036.7999999998]
[null,"Medicina Penitenziaria da Tabella 2",926803.57]
[null,"Differenze nella valorizzazione deI FondI CCNL"]
[null,"Stima Residuo Fondi da CE",-8922351.1400000006]
[null,"Voci di fondo pagate da CE",-34350092.859999985]
[null,"Fondo 2018 periodicizzato da Tabella 2",43347344.090000004]
[null,"totale",{"$f":"SUM(C10:C21)","v":178984844.05000001}]
[null,"costo complesivo del pesonale da CE",{"$f":"C7","v":178984844.05000001}]

{"sheet":"Fondi CCNL - Consistenza","index":33,"n_rows":19,"n_cols":10,"rows_kept":19,"cut":false,"hidden":false,"merged":[[0,0,0,9],[18,0,18,9]]}
["Consistenza e movimentazione dei fondi del personale "]
[null,"IMPORTO FONDO  AL 31/12/2010","IMPORTO FONDO  AL 01/01/2018","PERSONALE PRESENTE AL 01/01/2018","PERSONALE ASSUNTO NELL'ANNO 2018","PERSONALE CESSATO NELL'ANNO 2018","PERSONALE PRESENTE AL 31/12/2018","IMPORTO FONDO  AL 31/12/2018","VARIAZIONE FONDO ANNO 2018 VS FONDO ANNO 2010","VARIAZIONE FONDO ANNO 2018 VS FONDO INZIALE ANNO 2018"]
[null,"(1)","(2)","(3)","(4)","(5)","(6)=(3)+(4)-(5)","(7)","(8)=(7)-(1)","(9)=(7)-(2)"]
["MEDICI E VETERINARI"]
["- Fondo specificità medica, retribuzione di posizione, equiparazione, specifico trattamento",11626812,12180118.949608207,598,27,36,607,11695817.21338187,69005.213381869718,-484301.73622633703]
["- Fondo trattamento accessorio condizioni di lavoro",2596715,2596715.3173840092,598,27,36,607,2594805.9678859329,-1909.0321140671149,-1909.3494980763644]
["-Fondo retribuzione di risultato e qualità prestazioni individuale",339252,339251.68,598,27,36,607,339002.23023529409,-249.76976470591035,-249.44976470590336]
["DIRIGENTI  NON MEDICI SPTA"]
["- Fondo specificità medica, retribuzione di posizione, equiparazione, specifico trattamento",1330689,1155843.6296722372,75,4,5,76,1150223.4733498401,-180465.52665015985,-5620.1563223970588]
["- Fondo trattamento accessorio condizioni di lavoro",74746,71826.286871708289,75,4,5,76,71265.144005523078,-3480.8559944769222,-561.14286618521146]
["-Fondo retribuzione di risultato e qualità prestazioni individuale",93699,87567.076709710353,75,4,5,76,86992.043172926351,-6706.956827073649,-575.03353678400163]
["PERSONALE NON DIRIGENTE"]
["- Fondo fasce, posizioni organizzative, ex indennità di qualificazione professionale e indennità professionale specifica",8864277]
["- Fondo lavoro straordinario e remunerazione di particolari condizioni di disagio pericolo o danno",6037257,9042123.9703130741,2403,138,128,2393,8969636.0944051594,7364517.5944051594,-72487.875907914713]
["-Fondo della produttività collettiva per il  miglioramento dei servizi e premio della qualità delle prestazioni individuali",1523723,8061239.1956853932,2403,138,128,2393,7698270.3498571618,10606685.849857163,-362968.84582823142]
["TOTALE",32487170,33534686.106244341,null,null,null,null,32606012.516293708]
[]
[]
["Si precisa che la determinazione dei fondi è stata effettuata in conformità alle disposizioni di cui all’art.23 comma 2 del D. Lgs. n. 75/2017 e che pertanto le dinamiche del personale rilevate nell'anno 2018 ed indicate nella suddetta tabella non costituiscono ai sensi della predetta norma riferimento esclusivo ai fini della riduzione operata sui fondi contrattuali."]

{"sheet":"Fondi CCNL - Serie Storica","index":34,"n_rows":29,"n_cols":5,"rows_kept":29,"cut":false,"hidden":false,"merged":[[12,0,12,1],[16,0,16,1],[8,0,8,1],[0,0,0,4],[2,0,2,4],[3,0,3,1],[5,0,5,1],[6,0,6,1],[7,0,7,1],[9,0,9,1],[10,0,10,1],[11,0,11,1],[13,0,13,1],[14,0,14,1],[15,0,15,1],[17,0,17,1],[18,0,18,1],[26,0,26,5],[27,0,27,5],[28,0,28,5],[19,0,19,1],[21,0,21,1],[22,0,22,1],[23,0,23,1],[25,0,25,5],[20,0,20,1]]}
[" Serie storica dei fondi del personale "]
[]
["Dettaglio PERSONALE"]
["FONDI",null,2016,2017,2018]
["AREA DIRIGENZA MEDICO - VETERINARIA"]
["FONDO PER LA RETRIBUZIONE DI RISULTATO E PER LA QUALITA' DELLA PRESTAZIONE INDIVIDUALE ",null,339002.23023529409,339002.23023529409,339002.23023529409]
["FONDO PER IL TRATTAMENTO ACCESSORIO LEGATO ALLE CONDIZIONI DI LAVORO",null,2594805.9678859329,2594805.9678859329,2594805.9678859329]
["FONDO PER L'INDENNITA' DI SPECIFICITA' MEDICA, RETRIBUZIONE DI POSIZIONE, EQUIPARAZIONE, SPECIFICO TRATTAMENTO E INDENNITA' DI DIREZIONE DI STRUTTURA COMPLESSA",null,11695817.21338187,11695817.21338187,11695817.21338187]
["AREA DIRIGENZA SANITARIA NON MEDICA"]
["FONDO PER LA RETRIBUZIONE DI RISULTATO E PER LA QUALITÀ DELLA PRESTAZIONE INDIVIDUALE",null,73604.292708354755,73604.292708354755,73604.292708354755]
["FONDO PER IL TRATTAMENTO ACCESSORIO LEGATO ALLE CONDIZIONI DI LAVORO",null,70704.001139337852,70704.001139337852,70704.001139337852]
["FONDO PER LA RETRIBUZIONE DI POSIZIONE, EQUIPARAZIONE, SPECIFICO TRATTAMENTO E INDENNITA' DI DIREZIONE DI STRUTTURA COMPLESSA",null,485190.40488432813,485190.40488432813,485190.40488432813]
["AREA DIRIGENZA PROFESSIONI SANITARIE"]
["FONDO PER LA RETRIBUZIONE DI RISULTATO E PER LA QUALITÀ DELLA PRESTAZIONE INDIVIDUALE",null,575.03353678401947,575.03353678401947,575.03353678401947]
["FONDO PER IL TRATTAMENTO ACCESSORIO LEGATO ALLE CONDIZIONI DI LAVORO",null,561.14286618521965,561.14286618521965,561.14286618521965]
["FONDO PER LA RETRIBUZIONE DI POSIZIONE, EQUIPARAZIONE, SPECIFICO TRATTAMENTO E INDENNITA' DI DIREZIONE DI STRUTTURA COMPLESSA",null,6862.2100000000009,6862.2100000000009,6862.2100000000009]
["AREA DIRIGENZA PROFESSIONALE TECNICA ED AMMINISTRATIVA (P.T.A.)"]
["FONDO PER LA RETRIBUZIONE DI RISULTATO E PER LA QUALITÀ DELLA PRESTAZIONE INDIVIDUALE",null,12812.716927787573,12812.716927787573,12812.716927787573]
["FONDO PER IL TRATTAMENTO ACCESSORIO LEGATO ALLE CONDIZIONI DI LAVORO",null,0]
["FONDO PER LA RETRIBUZIONE DI POSIZIONE, EQUIPARAZIONE, SPECIFICO TRATTAMENTO E INDENNITA' DI DIREZIONE DI STRUTTURA COMPLESSA",null,658170.85846551193,658170.85846551193,658170.85846551193]
["AREA COMPARTO"]
["FONDO DELLA PRODUTTIVITA' COLLETTIVA",null,1482187.5757397155,1482187.5757397155,7698270.3498571618]
["FONDO PER I COMPENSI DI LAVORO STRAORDINARIO ETC.",null,5872687.1078298166,5872687.1078298166,8969636.0944051594]
["FONDO PER IL FINANZIAMENTO FASCE RETRIBUTIVE, POSIZIONI ORGANIZZATIVE, VALORE COMUNE DELLE EX INDENNITA' DI QUALIFICAZIONE PROFESSIONALE E INDENNITA' PROFESSIONALE SPECIFICA",null,8691009.5141174458,8691009.5141174477]
[]
["I riferimenti dei provvedimenti adottati dall'azienda in ordine alla costituzione dei Fondi Contrattuali sono i seguenti: "]
["Deliberazione DG N. 468 del 11/04/2019: Adozione Fondi Contrattuali Aree Dirigenza consuntivi anno 2018 e preventivi anno 2019"]
["Deliberazione DG  N. 467 del 11/04/2019: Adozione Fondi Contrattuali Consuntivi Anno 2018 e Preventivi Anno 2019 ai sensi degli articoli 80 e 81 Capo II CCNL Comparto Sanità stipulato il 21 Maggio 2018"]
["I provvedimenti sopra elencati sono allegati al presente bilancio."]

{"sheet":"Tab 71","index":35,"n_rows":22,"n_cols":6,"rows_kept":22,"cut":false,"hidden":false,"merged":[[0,0,0,5],[3,0,4,0],[3,1,4,1],[3,2,4,2],[3,3,4,3],[3,4,4,4],[2,1,2,5],[3,5,4,5],[20,0,20,1],[20,2,20,3],[21,0,21,1],[20,4,20,9],[21,4,21,9]]}
["22.     Oneri diversi di gestione"]
[]
[null,"Tab. 71 – Dettaglio oneri diversi di gestione"]
["CODICE MOD. CE","DETTAGLIO ONERI DIVERSI DI GESTIONE",{"$f":"\"Valore CE \" &'00 Aggregatore'!$F$2","v":"Valore CE 2018"},{"$f":"\"Valore CE \" &'00 Aggregatore'!$F$2-1","v":"Valore CE 2017"},"Variazioni\nimporto","%"]
[]
["BA2510","Imposte e tasse (escluso IRAP e IRES)",{"$f":"SUMIF('00 CE'!$B:$B,'Tab 71'!$A6,'00 CE'!G:G)","v":1247157.1599999999},{"$f":"SUMIF('00 CE'!$B:$B,'Tab 71'!$A6,'00 CE'!F:F)","v":1160574.8},{"$f":"C6-D6","v":86582.35999999987},{"$f":"IF(AND(C6=0,D6=0),0,IF(C6=0,\"\",IF(D6=0,\"\",E6/D6)))","v":7.4602998445253046E-2}]
["BA2520","Perdite su crediti",{"$f":"SUMIF('00 CE'!$B:$B,'Tab 71'!$A7,'00 CE'!G:G)","v":0},{"$f":"SUMIF('00 CE'!$B:$B,'Tab 71'!$A7,'00 CE'!F:F)","v":0},{"$f":"C7-D7","v":0},{"$f":"IF(AND(C7=0,D7=0),0,IF(C7=0,\"\",IF(D7=0,\"\",E7/D7)))","v":0}]
["BA2540","Indennità, rimborso spese e oneri sociali per gli Organi Direttivi e Collegio Sindacale",{"$f":"SUMIF('00 CE'!$B:$B,'Tab 71'!$A8,'00 CE'!G:G)","v":1338906.02},{"$f":"SUMIF('00 CE'!$B:$B,'Tab 71'!$A8,'00 CE'!F:F)","v":1430687.1400000001},{"$f":"C8-D8","v":-91781.120000000112},-6.415177534901173E-2]
["0709030101","Indennità, rimborso spese e oneri sociali per il Direttore Generale",137594.71,148784.1,{"$f":"C9-D9","v":-11189.390000000014},-7.5205549517724096E-2]
["0709030102","Indennità, rimborso spese e oneri sociali per il Direttore Amministrativo",119782.98,129339.76,-9556.7799999999988,-7.3888957270370689E-2]
["0709030103","Indennità, rimborso spese e oneri sociali per il Direttore Sanitario",162687.92000000001,167495.57,-4807.6499999999942,-2.8703147193683953E-2]
["0709030104","Indennità, rimborso spese e oneri sociali per i membri del Collegio Sindacale",42315.360000000001,44028.17,-1712.8099999999977,-3.8902593498662284E-2]
["0709030105","Indennità, rimborso spese e oneri sociali per i membri delle Commissioni varie",876525.05,941039.54,-64514.489999999991,-6.8556619841925015E-2]
["BA2550","Altri oneri diversi di gestione",{"$f":"SUMIF('00 CE'!$B:$B,'Tab 71'!$A14,'00 CE'!G:G)","v":251935.31999999998},{"$f":"SUMIF('00 CE'!$B:$B,'Tab 71'!$A14,'00 CE'!F:F)","v":292884.42000000004},{"$f":"C14-D14","v":-40949.100000000064},-0.13981317271843979]
["0709030201","Oneri diversi da decreti ingiuntivi, liti, arbitraggi e risarcimenti",565.77,328.09,{"$f":"C15-D15","v":237.68},"N/A"]
["0709030202","Oneri diversi derivanti da transazioni",0,0,{"$f":"C16-D16","v":0},"N/A"]
["0709030203","Altri oneri diversi di gestione",251369.55,292556.33,{"$f":"C17-D17","v":-41186.780000000028},-0.14078239223195077]
[null,"TOTALE",{"$f":"C6+C7+C8+C14","v":2837998.4999999995},{"$f":"D6+D7+D8+D14","v":2884146.3600000003},{"$f":"C18-D18","v":-46147.860000000801},-1.6000526408791817E-2]
[]
["Altre informazioni relative agli oneri diversi di gestione"]
["Informazione",null,"Caso presente in azienda?",null,"Se sì, illustrare"]
["OG01. Sono state rilevate significative variazioni rispetto all'esercizio precedente? ",null,null,"NO"]

{"sheet":"Punto 23","index":36,"n_rows":32,"n_cols":6,"rows_kept":32,"cut":false,"hidden":false,"merged":[[29,0,29,1],[29,2,29,3],[29,4,29,8],[30,4,30,8],[30,0,31,1],[30,2,31,2],[30,3,31,3],[31,4,31,8],[2,5,3,5],[2,0,3,0],[2,1,3,1],[2,2,3,2],[2,3,3,3],[2,4,3,4]]}
["23.     Accantonamenti"]
[]
["CODICE MOD. CE","DETTAGLIO ACCANTONAMENTI",{"$f":"\"Valore CE \" &'00 Aggregatore'!$F$2","v":"Valore CE 2018"},{"$f":"\"Valore CE \" &'00 Aggregatore'!$F$2-1","v":"Valore CE 2017"},"Variazioni\nimporto","%"]
[]
[null,"Accantonamenti per rischi:",{"$f":"SUM(C6:C10)","v":3927713.96},{"$f":"SUM(D6:D10)","v":17301441.66},{"$f":"C5-D5","v":-13373727.699999999},{"$f":"IF(AND(C5=0,D5=0),0,IF(C5=0,\"\",IF(D5=0,\"\",E5/D5)))","v":-0.77298342894276473}]
["BA2710","Accantonamenti per cause civili ed oneri processuali",{"$f":"SUMIF('00 CE'!$B:$B,'Punto 23'!$A6,'00 CE'!G:G)","v":1357811.38},{"$f":"SUMIF('00 CE'!$B:$B,'Punto 23'!$A6,'00 CE'!F:F)","v":9268206.2400000002},-7910394.8600000003,{"$f":"IF(AND(C6=0,D6=0),0,IF(C6=0,\"\",IF(D6=0,\"\",E6/D6)))","v":-0.85349793208744995}]
["BA2720","Accantonamenti per contenzioso personale dipendente",{"$f":"SUMIF('00 CE'!$B:$B,'Punto 23'!$A7,'00 CE'!G:G)","v":0},{"$f":"SUMIF('00 CE'!$B:$B,'Punto 23'!$A7,'00 CE'!F:F)","v":562892.11},{"$f":"C7-D7","v":-562892.11},""]
["BA2730","Accantonamenti per rischi connessi all'acquisto di prestazioni sanitarie da privato",{"$f":"SUMIF('00 CE'!$B:$B,'Punto 23'!$A8,'00 CE'!G:G)","v":272176.8},{"$f":"SUMIF('00 CE'!$B:$B,'Punto 23'!$A8,'00 CE'!F:F)","v":4358962},{"$f":"C8-D8","v":-4086785.2},-0.93755926296214565]
["BA2740","Accantonamenti per copertura diretta dei rischi (autoassicurazione)",{"$f":"SUMIF('00 CE'!$B:$B,'Punto 23'!$A9,'00 CE'!G:G)","v":2297725.7799999998},{"$f":"SUMIF('00 CE'!$B:$B,'Punto 23'!$A9,'00 CE'!F:F)","v":3111381.31},{"$f":"C9-D9","v":-813655.53000000026},-0.26150942264289689]
["BA2750","Altri accantonamenti per rischi",{"$f":"SUMIF('00 CE'!$B:$B,'Punto 23'!$A10,'00 CE'!G:G)","v":0},{"$f":"SUMIF('00 CE'!$B:$B,'Punto 23'!$A10,'00 CE'!F:F)","v":0},{"$f":"C10-D10","v":0},0]
["BA2760","Accantonamenti per premio di operosità (SUMAI)",{"$f":"SUMIF('00 CE'!$B:$B,'Punto 23'!$A11,'00 CE'!G:G)","v":264664.11},{"$f":"SUMIF('00 CE'!$B:$B,'Punto 23'!$A11,'00 CE'!F:F)","v":223015.56},41648.549999999988,0.18675176745514971]
[null,"Accantonamenti per quote inutilizzate di contributi vincolati:",{"$f":"C13+C14+C15+C16","v":7269835.4900000002},{"$f":"D13+D14+D15+D16","v":7068429.9500000002},201405.54000000004,2.849367418573626E-2]
["BA2780","Accantonamenti per quote inutilizzate contributi da Regione e Prov. Aut. per quota F.S. vincolato",{"$f":"SUMIF('00 CE'!$B:$B,'Punto 23'!$A13,'00 CE'!G:G)","v":7216729.6299999999},{"$f":"SUMIF('00 CE'!$B:$B,'Punto 23'!$A13,'00 CE'!F:F)","v":7018127.5499999998},{"$f":"C13-D13","v":198602.08000000007},2.8298442652271272E-2]
["BA2790","Accantonamenti per quote inutilizzate contributi da soggetti pubblici (extra fondo) vincolati",{"$f":"SUMIF('00 CE'!$B:$B,'Punto 23'!$A14,'00 CE'!G:G)","v":53105.86},{"$f":"SUMIF('00 CE'!$B:$B,'Punto 23'!$A14,'00 CE'!F:F)","v":50302.400000000001},{"$f":"C14-D14","v":2803.4599999999991},5.5732132065269231E-2]
["BA2800","Accantonamenti per quote inutilizzate contributi da soggetti pubblici per ricerca",{"$f":"SUMIF('00 CE'!$B:$B,'Punto 23'!$A15,'00 CE'!G:G)","v":0},{"$f":"SUMIF('00 CE'!$B:$B,'Punto 23'!$A15,'00 CE'!F:F)","v":0},{"$f":"C15-D15","v":0},0]
["BA2810","Accantonamenti per quote inutilizzate contributi vincolati da privati",{"$f":"SUMIF('00 CE'!$B:$B,'Punto 23'!$A16,'00 CE'!G:G)","v":0},{"$f":"SUMIF('00 CE'!$B:$B,'Punto 23'!$A16,'00 CE'!F:F)","v":0},{"$f":"C16-D16","v":0},0]
[null,"Altri accantonamenti:",{"$f":"SUM(C18:C24)","v":6766827},{"$f":"SUM(D18:D24)","v":2877740},3889087,1.3514379339342679]
["BA2830","Accantonamenti per interessi di mora",{"$f":"SUMIF('00 CE'!$B:$B,'Punto 23'!$A18,'00 CE'!G:G)","v":0},{"$f":"SUMIF('00 CE'!$B:$B,'Punto 23'!$A18,'00 CE'!F:F)","v":0},0,0]
["BA2840","Acc. Rinnovi convenzioni MMG/PLS/MCA",{"$f":"SUMIF('00 CE'!$B:$B,'Punto 23'!$A19,'00 CE'!G:G)","v":1507157},{"$f":"SUMIF('00 CE'!$B:$B,'Punto 23'!$A19,'00 CE'!F:F)","v":653733},853424,1.3054626277088659]
["BA2850","Acc. Rinnovi convenzioni Medici Sumai",{"$f":"SUMIF('00 CE'!$B:$B,'Punto 23'!$A20,'00 CE'!G:G)","v":200998},{"$f":"SUMIF('00 CE'!$B:$B,'Punto 23'!$A20,'00 CE'!F:F)","v":82934},118064,1.4235898425253817]
["BA2860","Acc. Rinnovi contratt.: dirigenza medica",{"$f":"SUMIF('00 CE'!$B:$B,'Punto 23'!$A21,'00 CE'!G:G)","v":2419388},{"$f":"SUMIF('00 CE'!$B:$B,'Punto 23'!$A21,'00 CE'!F:F)","v":757797},1661591,2.1926597756391222]
["BA2870","Acc. Rinnovi contratt.: dirigenza non medica",{"$f":"SUMIF('00 CE'!$B:$B,'Punto 23'!$A22,'00 CE'!G:G)","v":239284},{"$f":"SUMIF('00 CE'!$B:$B,'Punto 23'!$A22,'00 CE'!F:F)","v":74949},164335,2.1926243178694844]
["BA2880","Acc. Rinnovi contratt.: comparto",{"$f":"SUMIF('00 CE'!$B:$B,'Punto 23'!$A23,'00 CE'!G:G)","v":0},{"$f":"SUMIF('00 CE'!$B:$B,'Punto 23'!$A23,'00 CE'!F:F)","v":1008327},-1008327,""]
["BA2890","Altri accantonamenti",{"$f":"SUMIF('00 CE'!$B:$B,'Punto 23'!$A24,'00 CE'!G:G)","v":2400000},{"$f":"SUMIF('00 CE'!$B:$B,'Punto 23'!$A24,'00 CE'!F:F)","v":300000},2100000,7]
[null,"Accantonamento al fondo oneri personale in quiescenza ",{"$f":"SUMIF('00 CE'!$B:$B,'Punto 23'!$A25,'00 CE'!G:G)","v":0},{"$f":"SUMIF('00 CE'!$B:$B,'Punto 23'!$A25,'00 CE'!F:F)","v":0},0,0]
[null,"TOTALE",{"$f":"SUM(C25,C17,C12,C11,C5)","v":18229040.559999999},{"$f":"SUM(D25,D17,D12,D11,D5)","v":27470627.170000002},{"$f":"SUM(E25,E17,E12,E11,E5)","v":-9241586.6099999994},-0.33641702290992864]
[]
["AC01 - Altri accantonamenti"]
[]
["Informazione",null,"Caso presente in azienda?",null,"Se sì, illustrare"]
["AC01. La voce \"Altri accantonamenti\" è stata movimentata? Se sì, a fronte di quali rischi? ",null,null,"SI"," Nella voce \"Altri accantonamenti\" sono stati contabilizzati, ai sensi dell'art. 9, comma 1, decreto legge n. 203/2005, gli accantonamenti per rinnovi contrattuali sia con riferimento al personale dipendente (per €/000 2.658), sia a favore del personale convenzionato (per €/000 1.708). Quanto sopra in base alle disposizioni regionali, contenute nelle Linee Guida alla redazione del Bilancio al 31/12/2018, trasmesse con nota prot. n. RA/0122860/DPF012 del 19/04/2019."]
[null,null,null,null,"Tra gli Altri accantonamenti è stato iscritto, inoltre, l'accantonamento alla voce \"Altri fondi per oneri e spese\" per €/000 2.400, determinato sulla base della ricognizione della situazione debitoria della ditta Hospital Service Srl (nota prot. n. 0047592/19 del 15/04/2019), a fronte dell'eventuale futura emissione di fatture da parte della citata ditta per il servizio di lavanolo. "]

{"sheet":"Commento Accantonamenti","index":37,"n_rows":35,"n_cols":9,"rows_kept":35,"cut":false,"hidden":false,"merged":[[19,4,19,5],[31,0,31,8],[1,0,1,8],[2,0,2,8],[6,6,9,6],[6,7,9,7],[6,8,9,8],[5,0,10,0],[15,0,15,1],[16,0,17,0],[19,0,19,1],[26,0,28,8],[25,0,25,8],[30,0,30,8],[34,0,34,8],[23,0,23,8],[24,0,24,8],[32,0,33,8],[29,0,29,8]]}
["In relazione al Fondo rinnovi contrattuali personale dipendente , si fornisce di seguito il prospetto di dettaglio:"]
[]
["ACCANTONAMENTO  CONSUNTIVO 2018"]
[]
["Codice SP FONDO","Conto di coge","Codice CE","Descrizione","  Consuntivo 2015","Accantonamento  dello 3,48% ","Valore aggregato per codice CE acc","Codice CE accantonamento","Descrizione"]
["PBA230","0715040401","BA2110","Costo personale dirigente medico",69522650,{"$f":"E6*3.48/100","v":2419388.2200000002},{"$f":"F6","v":2419388.2200000002},"BA2860","Accantonamento rinnovi contrattuali : dirigenza medica"]
[null,"0715040501","BA2150","Costo personale dirigente non medico",5146822,{"$f":"E7*3.48/100","v":179109.4056},{"$f":"F7+F8+F9+F10","v":239284.66080000001},"BA2870","Accantonamento rinnovi contrattuali : dirigenza non medica"]
[null,"0715040502","BA2240","Costo personale dirigente ruolo professionale",418139,14551.2372]
[null,"0715040503","BA2330","Costo personale dirigente ruolo tecnico",492897,17152.815600000002]
[null,"0715040504","BA2420","Costo personale dirigente ruolo amministrativo",818138,28471.202399999998]
[null,null,null,"totale",{"$f":"SUM(E6:E10)","v":76398646},{"$f":"SUM(F6:F10)","v":2658672.8807999999},{"$f":"SUM(G6:G10)","v":2658672.8808000004}]
[]
[]
["In relazione al Fondo rinnovi convenzioni MMG - PLS - MCA, si fornisce di seguito il prospetto di dettaglio:"]
[]
["Voce",null,"CE consuntivo 2010","Quota da accantonare pari a 0,75%","CE consuntivo 2015","Base di calcolo accantonamento","Calcolo incremento  del 3,48% *","Quota da accantonare pari a 0,75%","Totale da accantonare "]
["BA0420",null,"a","b","c","('d=b+c)","e=d*3,48/100","f=b","g=e+f"]
[null,"Spese per assistenza MMG",35268675,{"$f":"C18*0.75/100","v":264515.0625},35443596,{"$f":"D18+E18","v":35708111.0625},{"$f":"F18*3.48/100","v":1242642.2649749999},{"$f":"0.75*C18/100","v":264515.0625},{"$f":"G18+H18","v":1507157.3274749999}]
["BA0570","Medici Sumai",3878582.33,{"$f":"C19*0.75/100","v":29089.367474999999},4910803,{"$f":"D19+E19","v":4939892.3674750002},{"$f":"F19*3.48/100","v":171908.25438813001},{"$f":"0.75*C19/100","v":29089.367474999999},{"$f":"G19+H19","v":200997.62186313001}]
["Totale",null,{"$f":"SUM(C18:C19)","v":39147257.329999998},293604.42997499998,"Totale",null,1414550.51936313,293604.42997499998,1708154.94933813]
[]
[]
[]
["Con riferimento alle somme accantonate al 31/12/2018 si evidenzia quanto segue:"]
["• L'accantonamento al Fondo per cause civili ed oneri processuali (€/000 1.358) deriva dalla stima effettuata dall’Ufficio Affari Legali per passività potenziali connesse al contenzioso giudiziario in corso al 31/12/2018, comunicata con nota prot. n. 0010844/19 del 29/01/2019 ed allegata al presente Bilancio. Rispetto al precedente esercizio, l'accantonamento per cause civili ed oneri processuali si è ridotto di €/000 7.910, che si erano resi necessari lo scorso esercizio a fronte delle cause di lavoro promosse dai medici convenzionati.   "]
["• Al 31/12/2018 non sono stati effettuati accantonamenti al Fondo per contenzioso personale dipendente, atteso che l'ammontare del fondo è risultato congruo in base alla stima effettuata dall’Ufficio Affari Legali, comunicata con nota prot. n. 0010844/19 del 29/01/2019 ed allegata al presente Bilancio."]
["• L'accantonamento per copertura diretta dei rischi (auto-assicurazione) si riferisce alle passività potenziali derivanti dalla liquidazione di franchigie previste nel contratto di polizza di rct/o, essendo esso giunto alla conclusione della triennale vigenza contrattuale. Trattasi di somme anticipate dalla Compagnia Assicuratrice  nelle varie annualità di polizza, il cui rimborso viene chiesto successivamente alla contraente azienda. L'accantonamento rilevato nel 2018 deriva dalla stima effettuata dall'Ufficio Affari Legali, comunicata con nota prot. n. 0010844/19 del 29/01/2019 ed allegata al presente Bilancio."]
[]
[]
["• Al 31/12/2018 è stata accantonata la somma di €/000 272 per rischi connessi all'acquisto di prestazioni sanitarie da privato accreditato, a fronte delle note di credito da ricevere richieste con nota prot. n. 0045208/19 del 09/04/2019, allegata al presente Bilancio, dal Direttore UOC Direzione Amministrativa del Territorio G.A.C.E.P. per l'extra-budget rilevato sulle prestazioni di RSA."]
["In particolare, in ordine a tale voce di accantonamento, si fa rinvio a quanto specificato dal Dirigente del Servizio Gestione Accordi Contrattuali Erogatori Privati con nota prot. n. 0012108/19 del 31/01/2019, successivamente confermato con nota prot. n. 0052625/19 del 29/04/2019, entrambe allegate al presente Bilancio.  Nello specifico, il servizio competente ha provveduto a richiedere le note credito (e per lo stesso importo è stato iscritto l'accantonamento al relativo fondo, come richiesto dalla Regione nelle Linee Guida ai bilanci di esercizio 2018) a quelle strutture per le quali è stato possibile determinare il fatturato prodotto in eccedenza rispetto ai tetti di spesa.   "]
["Anche tale voce di accantonamento si è ridotta rispetto al precedente esercizio, in quanto nel 2017, con determina n. DPF012/10 del 22/02/2019 del Servizio programmazione Economico-Finanziaria e Finanziamento del SSR, la Regione ha disposto uno specifico accantonamento di €/000 4.359 per pareggiare l'ammontare delle note di credito da ricevere ed il corrispondente fondo rischi."]
["• la somma di €/000 7.269, contabilizzata nella voce “Accantonamenti per quote inutilizzate di contributi vincolati”, corrisponde alle quote non utilizzate di contributi da Regione o Prov. Aut. per quota F.S. vincolato (€/000 7.216) e da soggetti pubblici extra fondo vincolati (€/000 53), contabilizzate a fondo come da specifiche istruzioni regionali contenute nelle Linee guida alla redazione del bilancio di esercizio 2018, trasmesse con nota prot. n. RA/0122860/DPF012 del 19/04/2019. "]
[]
["• In relazione alla voce \"Altri Accantonamenti\", si rinvia a quanto già evidenziato nei commenti alla pagina precedente. "]

{"sheet":"Punti 24-25","index":38,"n_rows":22,"n_cols":5,"rows_kept":22,"cut":false,"hidden":false,"merged":[[21,0,21,1],[21,4,21,5],[4,0,4,1],[4,4,4,7],[15,0,15,1],[20,0,20,1],[20,2,20,3],[20,4,20,5],[9,0,9,1],[0,0,0,3],[2,0,2,1],[2,2,2,3],[2,4,2,7],[3,0,3,1],[3,4,3,7]]}
["24.  Proventi e oneri finanziari"]
[]
["Informazione",null,"Caso presente in azienda?",null,"Se sì, illustrare"]
["OF01. Sono state rilevate significative variazioni rispetto all'esercizio precedente? ",null,"SI",null,"Nell'esercizio 2018 l'Azienda ha conseguito proventi finanziari, per €/000 1, dati da interessi attivi su c/c postali. Gli oneri finanziari, dettagliati nella tabella sottostante, hanno subito un significativo incremento, di circa €/000 1.289. Tale variazione è dovuta alla contabilizzazione degli interessi moratori fatturati dalla struttura Fisioter Sas su crediti extrabudget anni 2005 e successivi. Al riguardo è pendente un giudizio a seguito del ricorso presentato dalla struttura nei confronti della Regione e della ASL di Pescara. "]
["OF02. Nell'esercizio sono stati sostenuti oneri finanziari? Se sì, da quale operazione derivano? ",null,"SI",null,"Gli oneri finanziari contabilizzati nel 2018 sono principalmente rappresentati da interessi di mora su debiti commerciali. "]
[]
["Proventi finanziari"]
["Cod. Conto","Descrizione","Importo"]
["0401020101","Interessi attivi su c/c postali",1395.3]
["TOTALE",null,{"$f":"SUM(C9:C9)","v":1395.3}]
["Oneri finanziari"]
["Cod. Conto","Descrizione","Importo"]
["0801030101","Interessi moratori",1449403.09]
["0801030102","Altri interessi passivi",0]
["0802010101","Altri oneri finanziari",1932.36]
["TOTALE",null,{"$f":"SUM(C13:C15)","v":1451335.4500000002}]
[]
[]
["25. Rettifiche di valore di attività finanziarie"]
[]
["Informazione",null,"Caso presente in azienda?",null,"Se sì, illustrare"]
["RF01. Nell'esercizio sono state rilevate rettifiche di valore di attività finanziarie? ",null,null,"NO"]

{"sheet":"Punto 26","index":39,"n_rows":24,"n_cols":5,"rows_kept":24,"cut":false,"hidden":false,"merged":[[12,3,14,6],[15,3,17,6],[11,3,11,6],[23,0,24,8],[1,0,1,3],[7,0,7,1],[7,2,7,3],[8,0,8,1],[8,4,8,8],[7,4,7,8]]}
[]
["26. Proventi e oneri straordinari"]
[]
["PS01 - Plusvalenze/Minusvalenze"]
[]
[]
[]
["Informazione",null,"Caso presente in azienda?",null,"Se sì, illustrare"]
["PS01. Nell'esercizio sono state rilevate plusvalenze/minusvalenze? ",null,null,"NO","Nel corso del 2018 non sono state rilevate plusvalenze. Sono state rilevate minusvalenze per €/000 19, come di seguito dettagliate. "]
[]
[]
[null,"Tipologia beni dismessi","Importo minusvalenza","Riferimento Delibera"]
[null,"Computer",11.95,"Delibera del DG n. 588 del 04/06/2018"]
[null,"Attrezzature",4101.24]
[null,"Mobili e arredi",1757]
[null,"Attrezzature",12788.63,"Delibera del DG n. 1330 del 10/12/2018"]
[null,"Comuputer",211.22]
[null,"Mobili e arredi",660.2]
[null,"TOTALE",{"$f":"SUM(C13:C18)","v":19530.240000000002}]
[]
[]
[]
[]
["Nel corso dell'esercizio 2018 non sono stati ceduti beni acquistati con contributi in c/capitale. "]

{"sheet":"PS02-03-04-05","index":40,"n_rows":101,"n_cols":10,"rows_kept":101,"cut":false,"hidden":false,"merged":[[95,0,96,9],[97,0,99,9],[100,0,100,9],[76,0,76,9],[77,0,77,9],[78,0,78,9],[79,0,79,9],[93,0,93,1],[81,0,81,9],[82,0,82,9],[83,0,83,9],[84,0,84,9],[80,0,80,9],[16,0,16,9],[17,0,17,9],[70,0,70,9],[69,0,69,9],[44,0,44,9],[18,0,18,9],[19,0,19,9],[40,0,40,1],[45,0,45,9],[31,0,31,9],[32,0,32,9],[46,0,46,9],[47,0,47,9],[48,0,48,9],[65,0,65,1],[26,0,26,9],[12,0,12,9],[13,0,13,9],[43,0,43,9],[15,0,15,9],[9,0,9,1],[14,0,14,9],[20,0,20,9],[21,0,21,9],[22,0,22,9],[23,0,23,9],[24,0,24,9],[25,0,25,9],[27,0,27,9],[28,0,28,9],[29,0,29,9],[30,0,30,9],[74,0,74,9],[75,0,75,9],[71,0,71,9],[67,0,67,9],[68,0,68,9],[72,0,72,9],[73,0,73,9]]}
[]
["PS02 - Sopravvenienze attive"]
[]
["Conto","Descrizione Conto","Anni 2011 e precedenti","Anno 2012","Anno 2013","Anno 2014","Anno 2015","Anno 2016","Anno 2017","Valore al 31/12/2018"]
["0601020201","Sopravvenienze attive v/Aziende sanitarie pubbliche della Regione relative alla mobilità intraregionale",0,0,0,0,0,0,3032781,{"$f":"SUM(C5:I5)","v":3032781}]
["0601020202","Altre sopravvenienze attive v/Aziende sanitarie pubbliche della Regione",0,0,0,0,2559.5300000000002,10584,8130.95,{"$f":"SUM(C6:I6)","v":21274.48}]
["0601020207","Sopravvenienze attive v/terzi relative all'acquisto prestazioni sanitarie da operatori accreditati",{"$f":"1140282.95+84238.12","v":1224521.0699999998},0,893629.23,313271.39,0,0,204673.05,2636094.7399999998]
["0601020208","Sopravvenienze attive v/terzi relative all'acquisto di beni e servizi",0,0,0,0,196704.58,97003.11,175145.95,468853.64]
["0601020210","Altre sopravvenienze attive v/terzi",0,0,0,609826.12,170898.56,31516.68,568643.73,1380885.0899999999]
["TOTALE SOPRAVVENIENZE ATTIVE",null,{"$f":"SUM(C5:C9)","v":1224521.0699999998},0,893629.23,923097.51,370162.67,139103.79,3989374.68,{"$f":"SUM(C10:I10)","v":7539888.9499999993}]
[]
[]
["Sopravvenienze attive v/ASL della Regione relative alla mobilità intraregionale: l’importo di €/000 3.033 è dato dal conguaglio della mobilità  passiva intraregionale da pubblico 2017 per €/000 1.857 e della mobilità attiva intraregionale da pubblico 2017 per €/000 1.176, come da comunicazione regionale nota n. RA/0122860/DPF012  del 19/04/2019."]
["Altre sopravvenienze attive v/ASL della Regione: la voce, che ammonta a €/000 21, accoglie  le sopravvenienze attive relative a fatture emesse nei confronti delle  Aziende Sanitarie Regionali per prestazioni rese prevalentemente negli esercizi 2016/2017. "]
["Sopravvenienze attive v/terzi relative all'acquisto prestazioni sanitarie da operatori accreditati: il saldo (€/000 2.636) accoglie note di credito emesse da strutture convenzionate per extra budget e per decurtazioni a seguito di verbali di verifica per prestazioni di riabilitazione ex art. 26. Gli importi più significativi sono i seguenti: "]
["• Nota di credito di €/000 1.140 emessa dalla Fondazione Papa Paolo VI per prestazioni non dovute relative all'anno 2009, a seguito della transazione del 07/12/2018;"]
["• Nota di credito di €/000 894 emessa dalla Fondazione Papa Paolo VI per extra budget anno 2013;"]
["• Nota di credito di €/000 313 emessa dalla Fondazione Papa Paolo VI per extra budget anno 2014;"]
["• Nota di credito di €/000 84 emessa dalla struttura Alhena per extra budget anni 2007-2011;"]
["•Inoltre, la voce ccoglie la rilevazione di quota fissa e ticket per prestazioni rese nell'esercizio 2017 da strutture convenzionate."]
["Sopravvenienze attive verso terzi – relative all’acquisto di beni e servizi: la voce (€/000 469) accoglie prevalentemente note di credito emesse da ditte varie a storno di forniture avvenute in esercizi precedenti. Gli importi più significativi sono i seguenti:  "]
["• €/000 171, relative a note di credito emesse da Gilead Sciences Srl in applicazione dell'accordo determina AIFA 1353/2014 e 544/2015 (Harvoni); "]
["• €/000 97, relative a note di credito emesse da Bristol Myers Squibb Srl per storno fatture 2016 rimborso Cost Capping AIFA;"]
["• €/000 70, relative a nota di credito emessa dalla ditta Diogene Soc. coop. a r.l. per errata fatturazione del servizio di portierato anno 2017;"]
["• €/000 37, relative a nota di credito emessa dalla ditta Diaverum Italia Srl per storno prestazioni dialisi anni 2014/2017, come previsto da verbale di intesa del 13/08/2018;"]
["Sopravvenienze attive verso terzi – altre sopravvenienze attive: la voce accoglie tutte le altre sopravvenienze attive (per €/000 1.380), diverse da quelle classificate nelle restanti voci. In particolare, vi sono contabilizzate: "]
["• €/000 610, relativi al Contributo regionale per \"Servizio Elisoccorso\";"]
["• €/000 320, relativi al Contributo regionale per \"Prevenzione tardiva e avanzata infezione HIV\";"]
["• €/000 129, relativi alla capitalizzazione di costi per sistema finestra passamalati, erroneamente registrati nel 2015 come costo per manutenzioni;"]
["• €/000 98, relativi alla capitalizzazione di costi per riscatto di attrezzature e impianti in uso presso il laboratorio di manipolazione cellulare per la terapia cellulare avanzata presso il Dipartimento di Medicina Trasfusionale del PO di Pescara, erroneamente registrati nel 2017 come costo per manutenzioni;"]
["• €/000 82, credito IRES risultante da Modello Redditi 2018;"]
["• €/000 70, per fatture emesse nei confronti di aziende ospedaliere extra-regione per prelievi di organi anni 2015-2016-2017;"]
["• €/000 50, per fatture emesse nei confronti dei privati per ricoveri in RSA."]
[]
["PS03 - Insussistenze attive"]
[]
["Conto","Descrizione Conto","Anni 2011 e precedenti","Anno 2012","Anno 2013","Anno 2014","Anno 2015","Anno 2016","Anno 2017","Valore al 31/12/2018"]
["0601020306","Insussistenze attive verso terzi - relative all' acquisto di prestazioni sanitarie da operatori accreditati",312452.56,0,0,0,0.03,298.38,13638.64,{"$f":"SUM(C38:I38)","v":326389.61000000004}]
["0601020307","Insussistenze attive verso terzi - relative all' acquisto di beni e servizi",71686.600000000006,20544.79,673880.84,662781.30000000005,1360894.36,1513618.14,472348.81,{"$f":"SUM(C39:I39)","v":4775754.84}]
["0601020308"," Altre insussistenze attive v/terzi",1573.39,0,0,0,0,12819,{"$f":"5007.71+49394.11","v":54401.82},{"$f":"SUM(C40:I40)","v":68794.209999999992}]
["TOTALE INSUSSISTENZE ATTIVE",null,{"$f":"SUM(C38:C40)","v":385712.55000000005},{"$f":"SUM(D38:D40)","v":20544.79},673880.84,662781.30000000005,1360894.3900000001,1526735.5199999998,540389.27,5170938.66]
[]
[]
["Insussistenze attive verso terzi – relative all’acquisto di prestazioni sanitarie da operatori accreditati: la voce, che ammonta ad €/000 326, accoglie prevalentemente le insussistenze attive derivanti dalla chiusura di debiti v/strutture private accreditate per avvenuta prescrizione. I crediti di importo più rilevante sono i seguenti:"]
["• €/000 54, credito anno 2006 verso Biotest Snc - Laboratorio analisi cliniche;"]
["• €/000 45, credito anno 2007 verso Vuza Maria & C. Sas;"]
["• €/000 44, credito anno 2005 verso Laboratorio analisi Di Iorio Mario & C. Srl."]
["Insussistenze attive verso terzi – relative all’acquisto di beni e servizi: la voce, che ammonta ad €/000 4.776, accoglie le insussistenze attive derivanti dalla chiusura di debiti v/fornitori per l'acquisto di beni e servizi che risultano insussistenti. L'importo più significativo, pari complessivamente ad €/000 4.397, è relativo alle fatture per il servizio di lavanolo, emesse dalla ditta Hospital Service (pari ad €/000 5.697, al netto della nota di credito da ricevere di €/000 1.300), irregolari (giusta sentenza n. 764/2018) in quanto relative a servizi non resi dalla società emittente, bensì di spettanza dell'altra ditta componente dell'ATI, Servizi Ospedalieri, già regolarmente pagata. Come già specificato al punto 23 della presente nota integrativa, sulla base della ricognizione della situazione debitoria della ditta Hospital Service Srl (nota prot. n. 0047592/19 del 15/04/2019), oltre alla chiusura dei debiti relativi alle fatture irregolari, è stato rilevato un accantonamento alla voce \"Altri fondi per oneri e spese\" per €/000 2.400 a fronte dell'eventuale futura emissione di fatture da parte della citata ditta per il servizio di lavanolo effettivamente reso (stimato pari al rimanente 60% del servizio prestato sui PP.OO. di Penne e Popoli e presso altre strutture presenti sul territorio). "]
["Insussistenze attive verso terzi – altre insussistenze attive verso terzi: la voce ammonta a €/000 69, ed accoglie altre insussistenze attive di debiti non dovuti a vario titolo. Il saldo si compone di importi di rilevanza non significativa."]
[]
[]
["PS04 - Sopravvenienze passive"]
[]
[]
[]
["Conto","Descrizione Conto","Anni 2011 e precedenti","Anno 2012","Anno 2013","Anno 2014","Anno 2015","Anno 2016","Anno 2017","Valore al 31/12/2018"]
[1001020302,"Altre sopravvenienze passive v/Aziende sanitarie pubbliche della Regione",0,0,0,0,0,0,122869.51,{"$f":"SUM(C57:I57)","v":122869.51}]
[1001020304,"Sopravvenienze passive v/terzi relative al personale - dirigenza medica",0,0,0,0,0,0,3919.87,3919.87]
["1001020305","Sopravvenienze passive v/terzi relative al personale - dirigenza non medica",0,0,0,0,0,0,7520.5,7520.5]
[1001020306,"Sopravvenienze passive v/terzi relative al personale - comparto",62562.11,0,0,0,2463488.2599999998,0,64027.25,2590077.6199999996]
[1001020307,"Sopravvenienze passive v/terzi relative alle convenzioni con medici di base",0,0,0,0,0,0,2272.9499999999998,2272.9499999999998]
[1001020308,"Sopravvenienze passive v/terzi relative alle convenzioni con la specialistica",0,0,0,0,0,0,53207.86,53207.86]
[1001020309,"Sopravvenienze passive v/terzi relative all'acquisto prestazioni sanitarie da operatori accreditati",808071.04,0,31830.48,31227.63,0,16978.54,77234.42,965342.1100000001]
["1001020310","Sopravvenienze passive v/terzi relative all'acquisto di beni e servizi",28824.16,37987.53,6347.81,154387.53,216647.96,202196.02,1354670.53,2001061.54]
["1001020312","Altre sopravvenienze passive v/terzi",0,0,48766.87,475632,0,0,32631.68,557030.55000000005]
["TOTALE SOPRAVVENIENZE PASSIVE",null,{"$f":"SUM(C57:C65)","v":899457.31},37987.53,86945.16,661247.16,2680136.2199999997,219174.56,1718354.57,{"$f":"SUM(C66:I66)","v":6303302.5099999998}]
[]
["Sopravvenienze passive v/Aziende sanitarie pubbliche della Regione: la voce, che ammonta a €/000 123, accoglie  le sopravvenienze passive relative a fatture emesse dalle AASSLL regionali, riferite a prestazioni specialistiche erogate nel precedente esercizio, non registrate nel periodo di competenza in quanto pervenute nel 2018, dopo la data di predisposizione del bilancio al 31/12/2017."]
["Sopravvenienze passive v/terzi relative al personale – dirigenza medica: la voce, di importo pari a €/000 4, accoglie le sopravvenienze passive per arretrati (competenze e IRAP) di competenza di esercizi precedenti e non rilevati, spettanti alla dirigenza medica. La parte prevalente delle sopravvenienze in parola è generalmente attribuibile al pagamento di alcune indennità (indennità di esclusività rapporto ed altro ) riconosciute ex post . "]
["Sopravvenienze passive v/terzi relative al personale – dirigenza non medica: la voce, di importo pari a €/000 7, accoglie le sopravvenienze passive per arretrati (competenze e IRAP) di competenza di esercizi precedenti e non rilevati, spettanti alla dirigenza non medica. "]
["Sopravvenienze passive v/terzi relative al personale – personale comparto: la voce, di importo pari a €/000 2.590, accoglie le sopravvenienze passive per arretrati di competenza di esercizi precedenti e non rilevati, spettanti al personale del comparto. Il saldo al 31/12/2018 si compone prevalentemente delle seguenti voci:"]
["• €/000 2.463, relativi ad oneri per la vestizione derivanti dal contenzioso con il personale del comparto;"]
["• €/000 63, relativi a differenze contributive calcolate dall'INPS sulle retribuzioni del personale dipendente collocato in quiescenza, riferite alle retribuzioni anni 1971-2003."]
["Sopravvenienze passive verso terzi - relative alle convenzioni con medici di base: l'importo (€/000 2) accoglie la rilevazione di somme relative ad esercizi precedenti liquidate a medici di base."]
["Sopravvenienze passive verso terzi - relative alle convenzioni con la specialistica: l'importo accoglie la sopravvenienza passiva relativa a prestazioni di screening neonatale rese nell'anno 2017."]
[" Sopravvenienze passive v/terzi relative all’acquisto di prestazioni sanitarie da operatori accreditati: la voce accoglie le fatture emesse da operatori sanitari accreditati relative a prestazioni sanitarie di varia natura erogate negli anni precedenti, non registrate negli esercizi di competenza. Il saldo si compone prevalentemente delle seguenti voci:"]
["• €/000 306, relativi a prestazioni sanitarie rese in extra budget dalla struttura Fisioter Sas nell'esercizio 2005;"]
["• €/000 300, relativi a prestazioni sanitarie rese in extra budget dalla struttura Fisioter Sas nell'esercizio 2006;"]
["• €/000 185, relativi a prestazioni sanitarie rese in extra budget dalla struttura Fisioter Sas nell'esercizio 2007."]
["Sopravvenienze passive v/terzi relative all’acquisto di beni e servizi: la voce in esame, che ammonta complessivamente a €/000 2.001, accoglie diverse fatture pervenute e rilevate nell'esercizio, emesse da ditte varie a fronte di forniture di beni e servizi avvenute negli anni precedenti. Gli importi più significativi sono:"]
["- €/000 746, relativi agli aggiornamenti del canone di manutenzione delle apparecchiature elettromedicali anni 2014/2015/2016/2017, fatturati dalla società H.C. Hospital Consulting Spa; "]
["- €/000 434, relativi al conguaglio della fornitura di acqua anno 2017, fatturato dall'ACA Spa;   "]
["- €/000 169, relativi a prestazioni rese dalla Fondazione Caritas Onlus nell'esercizio 2017; "]
["- €/000 158, per regolazione premio polizza assicuratica Rct/o stipulata con AON Spa relativa al periodo Aprile-Dicembre 2017."]
["Sopravvenienze passive v/terzi – altre sopravvenienze passive: la voce, che ammonta ad €/000 557, accoglie  altre sopravvenienze passive, diverse da quelle classificate nelle precedenti voci. Il saldo comprende: per €/000  476, la II Rata TARI Comune di Pescara anno 2014, come da Determina del Dirigente del UOC Servizi Tecnici Manutentivi n. 106/T. MAN. del 11/07/2018, e per €/000 49, la somma corrisposta ad un medico specialista ambulatoriale interno a titolo di risarcimento danni, in base alla sentenza n. 60/2018.\n"]
[]
[]
["PS05 - Insussistenze passive"]
[]
["Conto","Descrizione Conto","Anni 2011 e precedenti","Anno 2012","Anno 2013","Anno 2014","Anno 2015","Anno 2016","Anno 2017","Valore al 31/12/2018"]
[1001020406,"Insussistenze passive v/terzi relative all'acquisto prestazioni sanitarie da operatori accreditati",3269.86,0,893629.23,812.4,9716.76,0,298.52,{"$f":"SUM(C91:I91)","v":907726.77}]
["1001020407","Insussistenze passive v/terzi relative all'acquisto di beni e servizi",0,0,0,0,0,0,33658.5,33658.5]
["1001020408","Altre insussistenze passive v/terzi",2105.81,0,48.76,3039.62,9.5,155510.98000000001,10315.700000000001,171030.37000000002]
["TOTALE INSUSSISTENZE PASSIVE",null,{"$f":"SUM(C91:C93)","v":5375.67},0,893677.99,3852.02,9726.26,155510.98000000001,44272.72,1112415.6400000001]
[]
["Insussistenze passive v/terzi relative all’acquisto di prestazioni sanitarie da operatori accreditati: la voce, che ammonta a €/000 907, accoglie la chiusura del saldo per note di credito da ricevere da operatori accreditati a seguito dell'emissione delle stesse, nel caso in cui a fronte della richiesta di emissione di tali note di credito non era stato accantonato il relativo fondo rischi. L'importo più significativo, pari ad €/000 894, è relativo alla nota di credito emessa da Fondazione Papa Paolo VI per extra budget anno 2013.  "]
[]
["Insussistenze passive v/terzi relative all’acquisto di beni e servizi: la voce, che ammonta a €/000 33, accoglie la rilevazione della chiusura di documenti dichiarati insussistenti. L'importo più rilevante, di €/000 21, si riferisce ad una nota di credito emessa da un avvocato a storno di una fattura per consulenze legali, pagate dalla controparte (sentenza n. 479/2018)"]
[]
[]
["Insussistenze passive v/terzi – altre insussistenze passive: la voce, di importo pari ad €/000 171, accoglie la rilevazione della chiusura di documenti dichiarati insussistenti per errate registrazioni o a seguito di emissione di note di credito. L'importo più significativo, pari ad €/000 93, è relativo alla rilevazione di due note di credito emesse nei confronti della Prefettura di Pescara a storno di fatture 2016 per prestazioni di ricovero rese ad extracomunitari negli anni 2012/2013/2014. "]

{"sheet":"PS06","index":41,"n_rows":29,"n_cols":7,"rows_kept":29,"cut":false,"hidden":false,"merged":[[2,6,2,10],[21,4,25,4],[25,0,25,1],[20,3,20,4],[8,3,8,4],[9,4,13,4],[13,0,13,1],[18,0,18,4],[3,6,4,10],[0,0,0,5],[2,0,2,3],[2,4,2,5],[6,0,6,4],[3,0,4,3],[3,4,4,4],[3,5,4,5]]}
["Altre informazioni"]
[]
["Informazione",null,null,null,"Caso presente in azienda?",null,"Se sì, illustrare"]
["PS06. Esistono altre informazioni che si ritiene necessario fornire per soddisfare la regola generale secondo cui \"Se le informazioni richieste da specifiche disposizioni di legge non sono sufficienti a dare una rappresentazione veritiera e corretta, si devono fornire le informazioni complementari necessarie allo scopo\" (art. 2423 CC)? ",null,null,null,null,"NO"]
[]
[]
["TABELLA DI RACCORDO - DETTAGLIO PROVENTI STRAORDINARI"]
[]
["Voce CE","Descrizione","Valore","Voce CE IV Dir."]
["EA0050","Totale sopravvenienze attive",7539888.9500000002,"a","E 1) b)"]
["EA0150","Totale insussistenze attive",5170938.66,"b"]
["EA0040","Proventi da donazioni e liberalità diverse",0]
["EA0250","Altri proventi straordinari",0]
["TOTALE Altri proventi straordinari",null,{"$f":"SUM(C10:C13)","v":12710827.609999999}]
[]
["a","Totale Tabella PS 02 Nota Integrativa"]
["b","Totale Tabella PS 03 Nota Integrativa"]
[]
["TABELLA DI RACCORDO - DETTAGLIO ONERI STRAORDINARI"]
[]
["Voce CE","Descrizione","Valore","Voce CE IV Dir."]
["EA0310","Totale sopravvenienze passive",6303302.5099999998,"c","E 2) b)"]
["EA0460","Totale insussistenze passive",1112415.6599999999,"d"]
["EA0300","Oneri da cause civili ed oneri processuali",0]
["EA0560","Altri oneri straordinari",0]
["TOTALE Altri oneri straordinari",null,{"$f":"SUM(C22:C25)","v":7415718.1699999999}]
[]
["c","Totale Tabella PS 04 Nota Integrativa"]
["d","Totale Tabella PS 05 Nota Integrativa"]

{"sheet":"PS07","index":42,"n_rows":0,"n_cols":0,"rows_kept":0,"cut":false,"hidden":false,"merged":[]}

{"sheet":"Foglio1","index":43,"n_rows":0,"n_cols":0,"rows_kept":0,"cut":false,"hidden":false,"merged":[]}